Segmentation Fault during Installation

Discussion in 'Installation/Configuration' started by 7son7son, Feb 23, 2006.

  1. 7son7son

    7son7son New Member

    So I am installing ISPConfig and a box running Ubuntu. Everything seems to go fine and then I get various problems occuring at different parts of the installation. Here is the latest. I have followed the Howto, but not sure what I am missing as of now. thanks




    gcc -I.. -I../.. -I../../include -DOPENSSL_THREADS -D_REENTRANT -DDSO_DLFCN -DHAVE_DLFCN_H -DL_ENDIAN -DTERMIO -O3 -fomit-frame-pointer -Wall -DOPENSSL_BN_ASM_PART_WORDS -DOPENSSL_IA32_SSE2 -DSHA1_ASM -DMD5_ASM -DRMD160_ASM -DAES_ASM -c -o pcy_cache.o pcy_cache.c
    In file included from ../../include/openssl/objects.h:65,
    from ../../include/openssl/evp.h:94,
    from ../../include/openssl/x509.h:73,
    from pcy_cache.c:60:
    ../../include/openssl/obj_mac.h:1: internal compiler error: Segmentation fault
    Please submit a full bug report,
    with preprocessed source if appropriate.
    See <URL:http://gcc.gnu.org/bugs.html> for instructions.
    For Debian GNU/Linux specific bug reporting instructions,
    see <URL:file:///usr/share/doc/gcc-4.0/README.Bugs>.
    make[2]: *** [pcy_cache.o] Error 1
    make[2]: Leaving directory `/usr/dl/install_ispconfig/compile_aps/openssl-0.9.8/crypto/x509v3'
    make[1]: *** [subdirs] Error 1
    make[1]: Leaving directory `/usr/dl/install_ispconfig/compile_aps/openssl-0.9.8/crypto'
    make: *** [build_crypto] Error 1
    ERROR: Could not make OpenSSL
    cd: error retrieving current directory: getcwd: cannot access parent directories: No such file or directory
    mv: cannot stat `binaries/aps.tar.gz': No such file or directory
    mv: cannot stat `binaries/spamassassin.tar.gz': No such file or directory
    mv: cannot stat `binaries/uudeview.tar.gz': No such file or directory
    mv: cannot stat `binaries/clamav.tar.gz': No such file or directory
    mv: cannot stat `binaries/cronolog': No such file or directory
    mv: cannot stat `binaries/cronosplit': No such file or directory
    mv: cannot stat `binaries/ispconfig_tcpserver': No such file or directory
    mv: cannot stat `binaries/zip': No such file or directory
    mv: cannot stat `binaries/unzip': No such file or directory
    tar: spamassassin.tar.gz: Cannot open: No such file or directory
    tar: Error is not recoverable: exiting now
    tar: Child returned status 2
    tar: Error exit delayed from previous errors
    mv: cannot stat `spamassassin': No such file or directory
    tar: uudeview.tar.gz: Cannot open: No such file or directory
    tar: Error is not recoverable: exiting now
    tar: Child returned status 2
    tar: Error exit delayed from previous errors
    mv: cannot stat `uudeview': No such file or directory
    tar: clamav.tar.gz: Cannot open: No such file or directory
    tar: Error is not recoverable: exiting now
    tar: Child returned status 2
    tar: Error exit delayed from previous errors
    mv: cannot stat `clamav': No such file or directory
    tar: aps.tar.gz: Cannot open: No such file or directory
    tar: Error is not recoverable: exiting now
    tar: Child returned status 2
    tar: Error exit delayed from previous errors
    ./setup2: line 771: ispconfig_tmp/php/bin/php: No such file or directory
    ERROR: The PHP binary coming with ISPConfig does not work properly on your system! The installation routine stops here!
    root@ku:/usr/dl/install_ispconfig#
     
  2. falko

    falko Super Moderator

Share This Page