ispconfig installation problem debian3.1

Discussion in 'Installation/Configuration' started by mesti, Dec 1, 2007.

  1. mesti

    mesti New Member

    Code:
     ".deps/lockdb.Tpo" -c -o lockdb.lo lockdb.c; \
    then mv -f ".deps/lockdb.Tpo" ".deps/lockdb.Plo"; else rm -f ".deps/lockdb.Tpo"; exit 1; fi
     gcc -DHAVE_CONFIG_H -I. -I. -I.. -I.. -I./unrar -I./nsis -I/usr/local/include -g -O2 -MT lockdb.lo -MD -MP -MF .deps/lockdb.Tpo -c lockdb.c  -fPIC -DPIC -o .libs/lockdb.o
     gcc -DHAVE_CONFIG_H -I. -I. -I.. -I.. -I./unrar -I./nsis -I/usr/local/include -g -O2 -MT lockdb.lo -MD -MP -MF .deps/lockdb.Tpo -c lockdb.c -o lockdb.o >/dev/null 2>&1
    /bin/sh ../libtool --tag=CC --mode=link gcc  -g -O2   -o libclamav.la -rpath /home/admispconfig/ispconfig/tools/clamav/lib -thread-safe -version-info 2:8:0 -no-undefined matcher-ac.lo matcher-bm.lo matcher-ncore.lo matcher.lo md5.lo others.lo readdb.lo cvd.lo dsig.lo str.lo scanners.lo filetypes.lo rtf.lo blob.lo mbox.lo message.lo snprintf.lo table.lo text.lo ole2_extract.lo vba_extract.lo msexpand.lo pe.lo upx.lo htmlnorm.lo chmunpack.lo rebuildpe.lo petite.lo wwunpack.lo suecrypt.lo unsp.lo aspack.lo packlibs.lo fsg.lo mew.lo upack.lo line.lo untar.lo unzip.lo special.lo binhex.lo is_tar.lo tnef.lo unrar15.lo unrarvm.lo unrar.lo unrarfilter.lo unrarppm.lo unrar20.lo unrarcmd.lo LZMADecode.lo bzlib.lo infblock.lo nulsft.lo pdf.lo spin.lo yc.lo elf.lo sis.lo uuencode.lo phishcheck.lo phish_domaincheck_db.lo phish_whitelist.lo regex_list.lo sha256.lo mspack.lo cab.lo entconv.lo hashtab.lo dconf.lo lockdb.lo -L/usr/local/lib -lz -lpthread -lnsl
    gcc -shared  .libs/matcher-ac.o .libs/matcher-bm.o .libs/matcher-ncore.o .libs/matcher.o .libs/md5.o .libs/others.o .libs/readdb.o .libs/cvd.o .libs/dsig.o .libs/str.o .libs/scanners.o .libs/filetypes.o .libs/rtf.o .libs/blob.o .libs/mbox.o .libs/message.o .libs/snprintf.o .libs/table.o .libs/text.o .libs/ole2_extract.o .libs/vba_extract.o .libs/msexpand.o .libs/pe.o .libs/upx.o .libs/htmlnorm.o .libs/chmunpack.o .libs/rebuildpe.o .libs/petite.o .libs/wwunpack.o .libs/suecrypt.o .libs/unsp.o .libs/aspack.o .libs/packlibs.o .libs/fsg.o .libs/mew.o .libs/upack.o .libs/line.o .libs/untar.o .libs/unzip.o .libs/special.o .libs/binhex.o .libs/is_tar.o .libs/tnef.o .libs/unrar15.o .libs/unrarvm.o .libs/unrar.o .libs/unrarfilter.o .libs/unrarppm.o .libs/unrar20.o .libs/unrarcmd.o .libs/LZMADecode.o .libs/bzlib.o .libs/infblock.o .libs/nulsft.o .libs/pdf.o .libs/spin.o .libs/yc.o .libs/elf.o .libs/sis.o .libs/uuencode.o .libs/phishcheck.o .libs/phish_domaincheck_db.o .libs/phish_whitelist.o .libs/regex_list.o .libs/sha256.o .libs/mspack.o .libs/cab.o .libs/entconv.o .libs/hashtab.o .libs/dconf.o .libs/lockdb.o  -L/usr/local/lib -lz -lpthread -lnsl  -Wl,-soname -Wl,libclamav.so.2 -o .libs/libclamav.so.2.0.8
    /usr/lib/libc_nonshared.a(atexit.oS)(.text.__i686.get_pc_thunk.bx+0x0): In function `__i686.get_pc_thunk.bx':
    : multiple definition of `__i686.get_pc_thunk.bx'
    /usr/lib/gcc-lib/i486-linux/3.3.5/crtbeginS.o(.gnu.linkonce.t.__i686.get_pc_thunk.bx+0x0): first defined here
    collect2: ld returned 1 exit status
    make[2]: *** [libclamav.la] Error 1
    make[2]: Leaving directory `/mnt/sda/ispconfig/install_ispconfig/compile_aps/clamav-0.91.2/libclamav'
    make[1]: *** [all-recursive] Error 1
    make[1]: Leaving directory `/mnt/sda/ispconfig/install_ispconfig/compile_aps/clamav-0.91.2'
    make: *** [all] Error 2
    ERROR: Could not make ClamAV
    cd: error retrieving current directory: getcwd: cannot access parent directories: Nincs ilyen fájl vagy könyvtár
    mv: stat "binaries/aps.tar.gz" sikertelen: Nincs ilyen fájl vagy könyvtár
    mv: stat "binaries/spamassassin.tar.gz" sikertelen: Nincs ilyen fájl vagy könyvtár
    mv: stat "binaries/uudeview.tar.gz" sikertelen: Nincs ilyen fájl vagy könyvtár
    mv: stat "binaries/clamav.tar.gz" sikertelen: Nincs ilyen fájl vagy könyvtár
    mv: stat "binaries/cronolog" sikertelen: Nincs ilyen fájl vagy könyvtár
    mv: stat "binaries/cronosplit" sikertelen: Nincs ilyen fájl vagy könyvtár
    mv: stat "binaries/ispconfig_tcpserver" sikertelen: Nincs ilyen fájl vagy könyvtár
    mv: stat "binaries/zip" sikertelen: Nincs ilyen fájl vagy könyvtár
    mv: stat "binaries/unzip" sikertelen: Nincs ilyen fájl vagy könyvtár
    tar: spamassassin.tar.gz: Cannot open: Nincs ilyen fájl vagy könyvtár
    tar: Error is not recoverable: exiting now
    tar: Child returned status 2
    tar: Error exit delayed from previous errors
    mv: stat "spamassassin" sikertelen: Nincs ilyen fájl vagy könyvtár
    tar: uudeview.tar.gz: Cannot open: Nincs ilyen fájl vagy könyvtár
    tar: Error is not recoverable: exiting now
    tar: Child returned status 2
    tar: Error exit delayed from previous errors
    mv: stat "uudeview" sikertelen: Nincs ilyen fájl vagy könyvtár
    tar: clamav.tar.gz: Cannot open: Nincs ilyen fájl vagy könyvtár
    tar: Error is not recoverable: exiting now
    tar: Child returned status 2
    tar: Error exit delayed from previous errors
    mv: stat "clamav" sikertelen: Nincs ilyen fájl vagy könyvtár
    tar: aps.tar.gz: Cannot open: Nincs ilyen fájl vagy könyvtár
    tar: Error is not recoverable: exiting now
    tar: Child returned status 2
    tar: Error exit delayed from previous errors
    ./setup2: line 873: ispconfig_tmp/php/bin/php: Nincs ilyen fájl vagy könyvtár
    ERROR: The PHP binary coming with ISPConfig does not work properly on your system! The installation routine stops here!


    why? :S:( please help:)
     
  2. falko

    falko Super Moderator ISPConfig Developer

    Did you see any errors before the one you posted?

    What's the output of
    Code:
    uname -a
    ?
     

Share This Page