ISP install problems Debian sarge 3.1

Discussion in 'Installation/Configuration' started by lerra, Jan 5, 2006.

  1. lerra

    lerra New Member

    I have a realy big problem, I have installed all requeriments and followd the howto but when I try to install ISPconfig thrue the shellscript setup it gets a error at openssl part and it gives alot of errors and removes everything in the same dir.
    Here is what i get before it crash:

    gcc -I.. -I../.. -I../../include -DOPENSSL_THREADS -D_REENTRANT -DDSO_DLFCN -DHAVE_DLFCN_H -DL_ENDIAN -DTERMIO -O3 -fomit-frame-pointer -Wall -DOPENSSL_BN_ASM_PART_WORDS -DOPENSSL_IA32_SSE2 -DSHA1_ASM -DMD5_ASM -DRMD160_ASM -DAES_ASM -c -o sha512.o sha512.c
    45sha512.c: In function `sha512_block':
    sha512.c:490: internal compiler error: Segmentation fault
    Please submit a full bug report,
    with preprocessed source if appropriate.
    See <URL:http://gcc.gnu.org/bugs.html> for instructions.
    For Debian GNU/Linux specific bug reporting instructions, see
    <URL:file:///usr/share/doc/gcc-3.3/README.Bugs>.
    make[2]: *** [sha512.o] Error 1
    make[2]: Leaving directory `/root/install_ispconfig/compile_aps/openssl-0.9.8/crypto/sha'
    make[1]: *** [subdirs] Error 1
    make[1]: Leaving directory `/root/install_ispconfig/compile_aps/openssl-0.9.8/crypto'
    make: *** [build_crypto] Error 1
    ERROR: Could not make OpenSSL cd: could not get current directory: getcwd: cannot access parent directories: No such file or directory
    cd: could not get current directory: getcwd: cannot access parent directories: No such file or directory
    job-working-directory: could not get current directory: getcwd: cannot access parent directories: No such file or directory
    mv: cannot stat `binaries/aps.tar.gz': No such file or directory
    job-working-directory: could not get current directory: getcwd: cannot access parent directories: No such file or directory
    mv: cannot stat `binaries/spamassassin.tar.gz': No such file or directory
    job-working-directory: could not get current directory: getcwd: cannot access parent directories: No such file or directory
    mv: cannot stat `binaries/uudeview.tar.gz': No such file or directory
    job-working-directory: could not get current directory: getcwd: cannot access parent directories: No such file or directory
    mv: cannot stat `binaries/clamav.tar.gz': No such file or directory
    job-working-directory: could not get current directory: getcwd: cannot access parent directories: No such file or directory
    mv: cannot stat `binaries/cronolog': No such file or directory
    job-working-directory: could not get current directory: getcwd: cannot access parent directories: No such file or directory
    mv: cannot stat `binaries/cronosplit': No such file or directory
    job-working-directory: could not get current directory: getcwd: cannot access parent directories: No such file or directory
    mv: cannot stat `binaries/ispconfig_tcpserver': No such file or directory
    job-working-directory: could not get current directory: getcwd: cannot access parent directories: No such file or directory
    mv: cannot stat `binaries/zip': No such file or directory
    job-working-directory: could not get current directory: getcwd: cannot access parent directories: No such file or directory
    mv: cannot stat `binaries/unzip': No such file or directory
    job-working-directory: could not get current directory: getcwd: cannot access parent directories: No such file or directory
    tar: spamassassin.tar.gz: Cannot open: No such file or directory
    tar: Error is not recoverable: exiting now
    tar: Child returned status 2
    tar: Error exit delayed from previous errors
    job-working-directory: could not get current directory: getcwd: cannot access parent directories: No such file or directory
    mv: cannot stat `spamassassin': No such file or directory
    job-working-directory: could not get current directory: getcwd: cannot access parent directories: No such file or directory
    tar: uudeview.tar.gz: Cannot open: No such file or directory
    tar: Error is not recoverable: exiting now
    tar: Child returned status 2
    tar: Error exit delayed from previous errors
    job-working-directory: could not get current directory: getcwd: cannot access parent directories: No such file or directory
    mv: cannot stat `uudeview': No such file or directory
    job-working-directory: could not get current directory: getcwd: cannot access parent directories: No such file or directory
    tar: clamav.tar.gz: Cannot open: No such file or directory
    tar: Error is not recoverable: exiting now
    tar: Child returned status 2
    tar: Error exit delayed from previous errors
    job-working-directory: could not get current directory: getcwd: cannot access parent directories: No such file or directory
    mv: cannot stat `clamav': No such file or directory
    job-working-directory: could not get current directory: getcwd: cannot access parent directories: No such file or directory
    tar: aps.tar.gz: Cannot open: No such file or directory
    tar: Error is not recoverable: exiting now
    tar: Child returned status 2
    tar: Error exit delayed from previous errors
    job-working-directory: could not get current directory: getcwd: cannot access parent directories: No such file or directory
    ./setup2: line 771: ispconfig_tmp/php/bin/php: No such file or directory
    ERROR: The PHP binary coming with ISPConfig does not work properly on your system! The installation routine stops here!
    job-working-directory: could not get current directory: getcwd: cannot access parent directories: No such file or directory
    mailserver:~/install_ispconfig#
     
  2. falko

    falko Super Moderator

Share This Page