installation failure

Discussion in 'Installation/Configuration' started by navop, May 13, 2008.

  1. navop

    navop New Member

    Followed the "Perfect Server 8.04 lts" to a tee, when installing ispconfig I get a fail error

    Please submit a full bug report,
    with preprocessed source if appropriate.
    See <URL:http://gcc.gnu.org/bugs.html> for instructions.
    For Debian GNU/Linux specific bug reporting instructions,
    see <URL:file:///usr/share/doc/gcc-4.2/README.Bugs>.
    make[2]: *** [sha1dgst.o] Error 1
    make[2]: Leaving directory `/root/install_ispconfig/compile_aps/openssl-0.9.7m/crypto/sha'
    make[1]: *** [subdirs] Error 1
    make[1]: Leaving directory `/root/install_ispconfig/compile_aps/openssl-0.9.7m/crypto'
    make: *** [sub_all] Error 1
    ERROR: Could not make OpenSSL
    cd: error retrieving current directory: getcwd: cannot access parent directories: No such file or directory
    mv: cannot stat `binaries/aps.tar.gz': No such file or directory
    mv: cannot stat `binaries/spamassassin.tar.gz': No such file or directory
    mv: cannot stat `binaries/uudeview.tar.gz': No such file or directory
    mv: cannot stat `binaries/clamav.tar.gz': No such file or directory
    mv: cannot stat `binaries/cronolog': No such file or directory
    mv: cannot stat `binaries/cronosplit': No such file or directory
    mv: cannot stat `binaries/ispconfig_tcpserver': No such file or directory
    mv: cannot stat `binaries/zip': No such file or directory
    mv: cannot stat `binaries/unzip': No such file or directory
    tar: spamassassin.tar.gz: Cannot open: No such file or directory
    tar: Error is not recoverable: exiting now
    tar: Child returned status 2
    tar: Error exit delayed from previous errors
    mv: cannot stat `spamassassin': No such file or directory
    tar: uudeview.tar.gz: Cannot open: No such file or directory
    tar: Error is not recoverable: exiting now
    tar: Child returned status 2
    tar: Error exit delayed from previous errors
    mv: cannot stat `uudeview': No such file or directory
    tar: clamav.tar.gz: Cannot open: No such file or directory
    tar: Error is not recoverable: exiting now
    tar: Child returned status 2
    tar: Error exit delayed from previous errors
    mv: cannot stat `clamav': No such file or directory
    tar: aps.tar.gz: Cannot open: No such file or directory
    tar: Error is not recoverable: exiting now
    tar: Child returned status 2
    tar: Error exit delayed from previous errors
    ./setup2: line 888: ispconfig_tmp/php/bin/php: No such file or directory
    ERROR: The PHP binary coming with ISPConfig does not work properly on your system! The installation routine stops here!

    Plz help

    Thanks
    Navop
     
  2. sagor

    sagor New Member

    I had exactly the same issue (PHP error at end, similar messages), and though I swore I followed the howto to the tee, I did miss one line in my copy/paste when installing 8.04.

    I re-did the install, this time checking off each line on paper with a pen, and it all worked. Some lines are similar, and sometimes we think we did it, but missed it...

    Try again, the howto does work... I have my perfect server Ubuntu 8.04 working after the howto....

    PS I did the whole install 3 times, first failed, second worked, and to be sure, I tried third, and it worked too... First and second were on same PC, third install was on different PC

    PPS, I was missing some libraries in first install. I did load them manually, and the ISPConfig compile worked, but I was not sure of the whole system, that's why I re-did it all...
     
    Last edited: May 13, 2008
  3. falko

    falko Super Moderator ISPConfig Developer

    Did you disable AppArmor? Does /bin/sh point to /bin/bash?
     
  4. navop

    navop New Member

    Did the following steps over

    9 Change The Default Shell

    ln -sf /bin/bash /bin/sh

    10 Disable AppArmor

    /etc/init.d/apparmor stop
    update-rc.d -f apparmor remove

    get the following errors:

    Please submit a full bug report,
    with preprocessed source if appropriate.
    See <URL:http://gcc.gnu.org/bugs.html> for instructions.
    For Debian GNU/Linux specific bug reporting instructions,
    see <URL:file:///usr/share/doc/gcc-4.2/README.Bugs>.
    make[1]: *** [s3_srvr.o] Error 1
    make[1]: Leaving directory `/root/install_ispconfig/compile_aps/openssl-0.9.7m/ssl'
    make: *** [sub_all] Error 1
    ERROR: Could not make OpenSSL
    cd: error retrieving current directory: getcwd: cannot access parent directories: No such file or directory
    mv: cannot stat `binaries/aps.tar.gz': No such file or directory
    mv: cannot stat `binaries/spamassassin.tar.gz': No such file or directory
    mv: cannot stat `binaries/uudeview.tar.gz': No such file or directory
    mv: cannot stat `binaries/clamav.tar.gz': No such file or directory
    mv: cannot stat `binaries/cronolog': No such file or directory
    mv: cannot stat `binaries/cronosplit': No such file or directory
    mv: cannot stat `binaries/ispconfig_tcpserver': No such file or directory
    mv: cannot stat `binaries/zip': No such file or directory
    mv: cannot stat `binaries/unzip': No such file or directory
    tar: spamassassin.tar.gz: Cannot open: No such file or directory
    tar: Error is not recoverable: exiting now
    tar: Child returned status 2
    tar: Error exit delayed from previous errors
    mv: cannot stat `spamassassin': No such file or directory
    tar: uudeview.tar.gz: Cannot open: No such file or directory
    tar: Error is not recoverable: exiting now
    tar: Child returned status 2
    tar: Error exit delayed from previous errors
    mv: cannot stat `uudeview': No such file or directory
    tar: clamav.tar.gz: Cannot open: No such file or directory
    tar: Error is not recoverable: exiting now
    tar: Child returned status 2
    tar: Error exit delayed from previous errors
    mv: cannot stat `clamav': No such file or directory
    tar: aps.tar.gz: Cannot open: No such file or directory
    tar: Error is not recoverable: exiting now
    tar: Child returned status 2
    tar: Error exit delayed from previous errors
    ./setup2: line 888: ispconfig_tmp/php/bin/php: No such file or directory
    ERROR: The PHP binary coming with ISPConfig does not work properly on your system! The installation routine stops here!

    Thanks
     
  5. falko

    falko Super Moderator ISPConfig Developer

    What's the output of
    Code:
    gcc -v
    ?
     

Share This Page