Horrible errors in install - any advice?

Discussion in 'Installation/Configuration' started by Aerik, Jun 23, 2007.

  1. Aerik

    Aerik New Member

    I got all this ugly stuff after the install script tried to generate RSA keys...

    31820:error:24064064:random number generator:SSLEAY_RAND_BYTES:pRNG not seeded:md_rand.c:503:You need to read the OpenSSL FAQ, http://www.openssl.org/support/faq.html
    31820:error:04088003:rsa routines:RSA_setup_blinding:BN lib:rsa_lib.c:407:
    31820:error:04066044:rsa routines:RSA_EAY_PRIVATE_ENCRYPT:internal error:rsa_eay.c:409:
    31820:error:0D0C3006:asn1 encoding routines:ASN1_item_sign:EVP lib:a_sign.c:276:
    mkcert.sh:Error: Failed to generate certificate signing request
    make[1]: *** [certificate] Error 1
    make[1]: Leaving directory `/install_ispconfig/compile_aps/apache_1.3.37/src'
    make: *** [certificate] Error 2
    ERROR: Could not make certificate for Apache
    cd: error retrieving current directory: getcwd: cannot access parent directories: No such file or directory
    mv: cannot stat `binaries/aps.tar.gz': No such file or directory
    mv: cannot stat `binaries/spamassassin.tar.gz': No such file or directory
    mv: cannot stat `binaries/uudeview.tar.gz': No such file or directory
    mv: cannot stat `binaries/clamav.tar.gz': No such file or directory
    mv: cannot stat `binaries/cronolog': No such file or directory
    mv: cannot stat `binaries/cronosplit': No such file or directory
    mv: cannot stat `binaries/ispconfig_tcpserver': No such file or directory
    mv: cannot stat `binaries/zip': No such file or directory
    mv: cannot stat `binaries/unzip': No such file or directory
    tar: spamassassin.tar.gz: Cannot open: No such file or directory
    tar: Error is not recoverable: exiting now
    tar: Child returned status 2
    tar: Error exit delayed from previous errors
    mv: cannot stat `spamassassin': No such file or directory
    tar: uudeview.tar.gz: Cannot open: No such file or directory
    tar: Error is not recoverable: exiting now
    tar: Child returned status 2
    tar: Error exit delayed from previous errors
    mv: cannot stat `uudeview': No such file or directory
    tar: clamav.tar.gz: Cannot open: No such file or directory
    tar: Error is not recoverable: exiting now
    tar: Child returned status 2
    tar: Error exit delayed from previous errors
    mv: cannot stat `clamav': No such file or directory
    tar: aps.tar.gz: Cannot open: No such file or directory
    tar: Error is not recoverable: exiting now
    tar: Child returned status 2
    tar: Error exit delayed from previous errors
    ./setup2: line 873: ispconfig_tmp/php/bin/php: No such file or directory
    ERROR: The PHP binary coming with ISPConfig does not work properly on your system! The installation routine stops here!

    Any ideas?

    Thanks,
    Aerik
     
  2. falko

    falko Super Moderator ISPConfig Developer

    Did you accept the default values for the certificate, or did you specify your own values? If you did the latter, it's possible that you entered something wrong which OpenSSL doesn't like.
     

Share This Page