Frustrated with ISPConfig install!

Discussion in 'Installation/Configuration' started by woozyerdaddee, May 18, 2006.

  1. woozyerdaddee

    woozyerdaddee New Member

    I want to post this while I am ranting about it: I have been trying to install ISPConfig for two weeks, and it keeps bombing! Here is my system stats, and I will post the log later when I get home:

    CPU: Intel P4, 1.8 gHz
    Mem: 512 meg PC133
    HD: 80 gig, with 4 gig swap
    OS: Mandrake 10.2/2005 SE

    I followed the "How-To" exactly (several times, in fact). There are several libs and files they tell you to install that don't appear to be included with the Mandrake 10.2 / 2005 SE distro, so I have had to go hunting for them (and all the dependant modules, also). I still get to a cetain point, and it gives me the "PHP does not work with your version..." error.

    ANY ideas? Anyone else experience this? I will post the text from the log later.

    Thanks,

    Andy
     
  2. sjau

    sjau Local Meanie Moderator HowtoForge Supporter

    Have you tried another distro like Debian?
     
  3. falko

    falko Super Moderator Howtoforge Staff Moderator HowtoForge Supporter ISPConfig Developer

    Yes, please post the exact error messages (there must be an error before the PHP error comes up).
     
  4. woozyerdaddee

    woozyerdaddee New Member

    Log

    Here is my log. It is a bit lengthy, but I started where things appear to have started going wrong. I truncated the "/usr/include" errors. They were all about the same. Thanks for looking!

    In file included from /usr/include/tk.h:1576,
    from uuwish.c:33:
    /usr/include/tkDecls.h:37: error: syntax error before '*' token
    /usr/include/tkDecls.h:932: error: syntax error before "XColor"
    /usr/include/tkDecls.h:933: error: syntax error before '*' token
    /usr/include/tkDecls.h:933: error: `GC' declared as function returning a function
    /usr/include/tkDecls.h:934: error: syntax error before "Drawable"
    /usr/include/tkDecls.h:935: error: syntax error before "Drawable"
    /usr/include/tkDecls.h:937: error: syntax error before "XEvent"
    /usr/include/tkDecls.h:941: error: syntax error before '*' token
    /usr/include/tkDecls.h:942: error: syntax error before "Pixmap"
    /usr/include/tkDecls.h:943: error: syntax error before "XColor"
    /usr/include/tkDecls.h:946: error: syntax error before "Pixmap"
    /usr/include/tkDecls.h:948: error: syntax error before "GC"
    /usr/include/tkDecls.h:953: error: syntax error before "XSetWindowAttributes"
    /usr/include/tkDecls.h:955: error: syntax error before "Atom"
    /usr/include/tkDecls.h:956: error: syntax error before "Atom"
    /usr/include/tkDecls.h:961: error: syntax error before "XWindowChanges"
    /usr/include/tkDecls.h:966: error: syntax error before '*' token
    /usr/include/tkDecls.h:972: error: syntax error before "Atom"
    /usr/include/tkDecls.h:984: error: syntax error before "Atom"
    /usr/include/tkDecls.h:988: error: syntax error before "Drawable"
    /usr/include/tkDecls.h:989: error: syntax error before "Drawable"
    /usr/include/tkDecls.h:990: error: syntax error before '*' token
    /usr/include/tkDecls.h:991: error: syntax error before "GC"
    /usr/include/tkDecls.h:992: error: syntax error before '*' token
    /usr/include/tkDecls.h:993: error: syntax error before "Drawable"
    /usr/include/tkDecls.h:994: error: syntax error before "Drawable"
    /usr/include/tkDecls.h:996: error: syntax error before '*' token
    /usr/include/tkDecls.h:996: error: `Font' declared as function returning a function
    /usr/include/tkDecls.h:998: error: syntax error before '*' token
    /usr/include/tkDecls.h:999: error: syntax error before '*' token
    /usr/include/tkDecls.h:1000: error: syntax error before '*' token
    /usr/include/tkDecls.h:1001: error: syntax error before '*' token
    /usr/include/tkDecls.h:1003: error: syntax error before '*' token
    /usr/include/tkDecls.h:1005: error: syntax error before "Display"
    /usr/include/tkDecls.h:1006: error: syntax error before '*' token
    /usr/include/tkDecls.h:1008: error: syntax error before '*' token
    /usr/include/tkDecls.h:1009: error: syntax error before '*' token
    /usr/include/tkDecls.h:1009: error: syntax error before '*' token
    /usr/include/tkDecls.h:1009: error: `GC' declared as function returning a function
    /usr/include/tkDecls.h:1014: error: syntax error before "Atom"
    /usr/include/tkDecls.h:1016: error: syntax error before '*' token
    /usr/include/tkDecls.h:1016: error: `Pixmap' declared as function returning a function
    /usr/include/tkDecls.h:1017: error: syntax error before '*' token
    /usr/include/tkDecls.h:1017: error: `Pixmap' declared as function returning a function
    /usr/include/tkDecls.h:1019: error: syntax error before '*' token
    /usr/include/tkDecls.h:1020: error: syntax error before '*' token
    /usr/include/tkDecls.h:1020: error: syntax error before "XColor"
    /usr/include/tkDecls.h:1021: error: syntax error before '*' token
    /usr/include/tkDecls.h:1021: error: `Colormap' declared as function returning a function
    /usr/include/tkDecls.h:1027: error: syntax error before '*' token
    /usr/include/tkDecls.h:1027: error: syntax error before "XGCValues"
    /usr/include/tkDecls.h:1027: error: `GC' declared as function returning a function
    /usr/include/tkDecls.h:1036: error: syntax error before '*' token
    /usr/include/tkDecls.h:1036: error: syntax error before '*' token
    /usr/include/tkDecls.h:1036: error: `Pixmap' declared as function returning a function
    /usr/include/tkDecls.h:1041: error: syntax error before "Atom"
    /usr/include/tkDecls.h:1043: error: syntax error before '*' token
    /usr/include/tkDecls.h:1043: error: syntax error before "Colormap"
    /usr/include/tkDecls.h:1046: error: syntax error before '*' token
    /usr/include/tkDecls.h:1047: error: syntax error before '*' token
    /usr/include/tkDecls.h:1050: error: syntax error before '*' token
    /usr/include/tkDecls.h:1050: error: `Atom' declared as function returning a function
    /usr/include/tkDecls.h:1063: error: syntax error before '*' token
    /usr/include/tkDecls.h:1065: error: syntax error before '*' token
    /usr/include/tkDecls.h:1066: error: syntax error before '*' token
    /usr/include/tkDecls.h:1073: error: syntax error before "Atom"
    /usr/include/tkDecls.h:1084: error: syntax error before '*' token
    /usr/include/tkDecls.h:1085: error: syntax error before '*' token
    /usr/include/tkDecls.h:1086: error: syntax error before "Drawable"
    /usr/include/tkDecls.h:1097: error: syntax error before "Pixmap"
    /usr/include/tkDecls.h:1100: error: syntax error before "Pixmap"
    /usr/include/tkDecls.h:1101: error: syntax error before "Colormap"
    /usr/include/tkDecls.h:1102: error: syntax error before "Visual"
    /usr/include/tkDecls.h:1103: error: syntax error before '*' token
    /usr/include/tkDecls.h:1109: error: syntax error before '*' token
    /usr/include/tkDecls.h:1110: error: syntax error before '*' token
    /usr/include/tkDecls.h:1116: error: syntax error before '*' token
    /usr/include/tkDecls.h:1116: error: `Pixmap' declared as function returning a function
    /usr/include/tkDecls.h:1118: error: syntax error before '*' token
    /usr/include/tkDecls.h:1132: error: syntax error before '*' token
    /usr/include/tkDecls.h:1132: error: `Pixmap' declared as function returning a function
    /usr/include/tkDecls.h:1133: error: syntax error before '*' token
    /usr/include/tkDecls.h:1152: error: syntax error before '*' token
    /usr/include/tkDecls.h:1153: error: syntax error before '*' token
    /usr/include/tkDecls.h:1154: error: syntax error before '*' token
    /usr/include/tkDecls.h:1155: error: syntax error before "Tk_Outline"
    /usr/include/tkDecls.h:1156: error: syntax error before "Tk_Outline"
    /usr/include/tkDecls.h:1157: error: syntax error before "Tk_Outline"
    /usr/include/tkDecls.h:1158: error: syntax error before "GC"
    /usr/include/tkDecls.h:1160: error: syntax error before "GC"
    /usr/include/tkDecls.h:1162: error: syntax error before "Pixmap"
    /usr/include/tkDecls.h:1163: error: syntax error before "XColor"
    /usr/include/tkDecls.h:1167: error: syntax error before "Pixmap"
    /usr/include/tkDecls.h:1173: error: syntax error before "Tk_ClassProcs"
    /usr/include/tkDecls.h:1179: error: syntax error before '*' token
    /usr/include/tkDecls.h:1195: error: syntax error before "Drawable"
    /usr/include/tkDecls.h:1201: error: syntax error before '*' token
    make[1]: *** [uuwish.o] Error 1
    make[1]: Leaving directory `/ispc/install_ispconfig/compile_aps/uudeview-0.5.20/tcl'
    make: *** [xdeview] Error 2
    ERROR: Could not make UUDeview
    cd: error retrieving current directory: getcwd: cannot access parent directories: No such file or directory
    mv: cannot stat `binaries/aps.tar.gz': No such file or directory
    mv: cannot stat `binaries/spamassassin.tar.gz': No such file or directory
    mv: cannot stat `binaries/uudeview.tar.gz': No such file or directory
    mv: cannot stat `binaries/clamav.tar.gz': No such file or directory
    mv: cannot stat `binaries/cronolog': No such file or directory
    mv: cannot stat `binaries/cronosplit': No such file or directory
    mv: cannot stat `binaries/ispconfig_tcpserver': No such file or directory
    mv: cannot stat `binaries/zip': No such file or directory
    mv: cannot stat `binaries/unzip': No such file or directory
    tar: spamassassin.tar.gz: Cannot open: No such file or directory
    tar: Error is not recoverable: exiting now
    tar: Child returned status 2
    tar: Error exit delayed from previous errors
    mv: cannot stat `spamassassin': No such file or directory
    tar: uudeview.tar.gz: Cannot open: No such file or directory
    tar: Error is not recoverable: exiting now
    tar: Child returned status 2
    tar: Error exit delayed from previous errors
    mv: cannot stat `uudeview': No such file or directory
    tar: clamav.tar.gz: Cannot open: No such file or directory
    tar: Error is not recoverable: exiting now
    tar: Child returned status 2
    tar: Error exit delayed from previous errors
    mv: cannot stat `clamav': No such file or directory
    tar: aps.tar.gz: Cannot open: No such file or directory
    tar: Error is not recoverable: exiting now
    tar: Child returned status 2
    tar: Error exit delayed from previous errors
    ./setup2: line 794: ispconfig_tmp/php/bin/php: No such file or directory
    ERROR: The PHP binary coming with ISPConfig does not work properly on your system! The installation routine stops here!
     
  5. woozyerdaddee

    woozyerdaddee New Member

    I fixed it!

    OK, so I got it working. Not sure why, but on a whim, I went through the Mandrake 2006 setup, and loaded all of the programs we are told to load in that How-To, and it made my install work.

    Is it possible that the 2005 LE that I have is some sort of hybrid? Anyway, thank you for the help.

    Andy
     

Share This Page