Go Back   HowtoForge Forums | HowtoForge - Linux Howtos and Tutorials > ISPConfig 2 > Installation/Configuration

Do you like HowtoForge? Please consider supporting us by becoming a subscriber.
Reply
 
Thread Tools Display Modes
  #1  
Old 23rd June 2006, 17:45
Hauphat Hauphat is offline
Junior Member
 
Join Date: Jun 2006
Posts: 3
Thanks: 0
Thanked 0 Times in 0 Posts
Default Perfect Setup SuSE 10.0 problem with ISPConfig

Hello. I am new here and need some help with the install of ISPConfig. It seems to get near the end of compile (only as guess as it did a ton before it quit) and it errors out with a bunch of stuff I dont know how to fix. Any help would be appreciated. See below.

checking for mcrypt support... no
checking for mhash support... no
checking whether to include mime_magic support... no
checking for MING support... no
checking for mSQL support... no
checking for MSSQL support via FreeTDS... no
checking for MySQL support... yes
checking for specified location of the MySQL UNIX socket... no
checking for MySQL UNIX socket location... no
configure: error: Cannot find MySQL header files under /usr.
Note that the MySQL client library is not bundled anymore!
ERROR: Could not configure PHP
cd: error retrieving current directory: getcwd: cannot access parent directories: No such file or directory
mv: cannot stat `binaries/aps.tar.gz': No such file or directory
mv: cannot stat `binaries/spamassassin.tar.gz': No such file or directory
mv: cannot stat `binaries/uudeview.tar.gz': No such file or directory
mv: cannot stat `binaries/clamav.tar.gz': No such file or directory
mv: cannot stat `binaries/cronolog': No such file or directory
mv: cannot stat `binaries/cronosplit': No such file or directory
mv: cannot stat `binaries/ispconfig_tcpserver': No such file or directory
mv: cannot stat `binaries/zip': No such file or directory
mv: cannot stat `binaries/unzip': No such file or directory
tar: spamassassin.tar.gz: Cannot open: No such file or directory
tar: Error is not recoverable: exiting now
tar: Child returned status 2
tar: Error exit delayed from previous errors
mv: cannot stat `spamassassin': No such file or directory
tar: uudeview.tar.gz: Cannot open: No such file or directory
tar: Error is not recoverable: exiting now
tar: Child returned status 2
tar: Error exit delayed from previous errors
mv: cannot stat `uudeview': No such file or directory
tar: clamav.tar.gz: Cannot open: No such file or directory
tar: Error is not recoverable: exiting now
tar: Child returned status 2
tar: Error exit delayed from previous errors
mv: cannot stat `clamav': No such file or directory
tar: aps.tar.gz: Cannot open: No such file or directory
tar: Error is not recoverable: exiting now
tar: Child returned status 2
tar: Error exit delayed from previous errors
./setup2: line 794: ispconfig_tmp/php/bin/php: No such file or directory
ERROR: The PHP binary coming with ISPConfig does not work properly on your system! The installation routine stops here!


Until this point, everything in the how-to worked perfectly so not sure why I am getting these errors. I am a newb so I might be easily confused /shrug .

Thanks in advance
Reply With Quote
Sponsored Links
  #2  
Old 24th June 2006, 15:11
falko falko is offline
Super Moderator
 
Join Date: Apr 2005
Location: Lneburg, Germany
Posts: 41,701
Thanks: 1,900
Thanked 2,740 Times in 2,575 Posts
Default

Please make sure you installed mysql-devel. Please run
Code:
yast -i mysql mysql-client mysql-shared perl-DBD-mysql perl-DBI perl-Data-ShowTable mysql-devel
again.
__________________
Falko
--
Download the ISPConfig 3 Manual! | Check out the ISPConfig 3 Billing Module!

FB: http://www.facebook.com/howtoforge

nginx-Webhosting: Timme Hosting | Follow me on:
Reply With Quote
  #3  
Old 24th June 2006, 15:43
Hauphat Hauphat is offline
Junior Member
 
Join Date: Jun 2006
Posts: 3
Thanks: 0
Thanked 0 Times in 0 Posts
Default

Thank Falko for you quick response. I tried this yesterday but went ahead and did it again. Now I get this:

In file included from ../../include/openssl/crypto.h:139,
from ../cryptlib.h:72,
from p5_crpt2.c:60:
../../include/openssl/symhacks.h:59: internal compiler error: Segmentation fault

Please submit a full bug report,
with preprocessed source if appropriate.
See <URL:http://www.suse.de/feedback> for instructions.
make[2]: *** [p5_crpt2.o] Error 1
make[2]: Leaving directory `/tmp/install_ispconfig/compile_aps/openssl-0.9.8a/crypto/evp'
make[1]: *** [subdirs] Error 1
make[1]: Leaving directory `/tmp/install_ispconfig/compile_aps/openssl-0.9.8a/crypto'
make: *** [build_crypto] Error 1
ERROR: Could not make OpenSSL
cd: error retrieving current directory: getcwd: cannot access parent directories: No such file or directory
mv: cannot stat `binaries/aps.tar.gz': No such file or directory
mv: cannot stat `binaries/spamassassin.tar.gz': No such file or directory
mv: cannot stat `binaries/uudeview.tar.gz': No such file or directory
mv: cannot stat `binaries/clamav.tar.gz': No such file or directory
mv: cannot stat `binaries/cronolog': No such file or directory
mv: cannot stat `binaries/cronosplit': No such file or directory
mv: cannot stat `binaries/ispconfig_tcpserver': No such file or directory
mv: cannot stat `binaries/zip': No such file or directory
mv: cannot stat `binaries/unzip': No such file or directory
tar: spamassassin.tar.gz: Cannot open: No such file or directory
tar: Error is not recoverable: exiting now
tar: Child returned status 2
tar: Error exit delayed from previous errors
mv: cannot stat `spamassassin': No such file or directory
tar: uudeview.tar.gz: Cannot open: No such file or directory
tar: Error is not recoverable: exiting now
tar: Child returned status 2
tar: Error exit delayed from previous errors
mv: cannot stat `uudeview': No such file or directory
tar: clamav.tar.gz: Cannot open: No such file or directory
tar: Error is not recoverable: exiting now
tar: Child returned status 2
tar: Error exit delayed from previous errors
mv: cannot stat `clamav': No such file or directory
tar: aps.tar.gz: Cannot open: No such file or directory
tar: Error is not recoverable: exiting now
tar: Child returned status 2
tar: Error exit delayed from previous errors
./setup2: line 794: ispconfig_tmp/php/bin/php: No such file or directory
ERROR: The PHP binary coming with ISPConfig does not work properly on your system! The installation routine stops here!

Unfortunately, bugzilla seems to be down so I cant post a bug report about it. Any ideas why this would happen?
Reply With Quote
  #4  
Old 24th June 2006, 16:29
till till is offline
Super Moderator
 
Join Date: Apr 2005
Location: Lneburg, Germany
Posts: 35,771
Thanks: 821
Thanked 5,331 Times in 4,183 Posts
Default

Quote:
Originally Posted by Hauphat
Unfortunately, bugzilla seems to be down so I cant post a bug report about it. Any ideas why this would happen?
Segmentation faults may also be caused by your hardware, e.g a RAM module. I have never seen this error in the OpenSSL version that comes with ISPConfig, so I guess it is not a general OpenSSL bug.
__________________
Till Brehm
--
Get ISPConfig support and the ISPConfig 3 manual from ispconfig.org.
Reply With Quote
  #5  
Old 26th June 2006, 18:20
Hauphat Hauphat is offline
Junior Member
 
Join Date: Jun 2006
Posts: 3
Thanks: 0
Thanked 0 Times in 0 Posts
Default

I figured as much
Before I go out and spend money on new memory could this be cause by low memory or even another program/process that is running?
Reply With Quote
  #6  
Old 27th June 2006, 12:14
falko falko is offline
Super Moderator
 
Join Date: Apr 2005
Location: Lneburg, Germany
Posts: 41,701
Thanks: 1,900
Thanked 2,740 Times in 2,575 Posts
 
Default

You can test your memory with memtest86: http://www.memtest86.com/
__________________
Falko
--
Download the ISPConfig 3 Manual! | Check out the ISPConfig 3 Billing Module!

FB: http://www.facebook.com/howtoforge

nginx-Webhosting: Timme Hosting | Follow me on:
Reply With Quote
Reply

Bookmarks

Thread Tools
Display Modes

Posting Rules
You may not post new threads
You may not post replies
You may not post attachments
You may not edit your posts

BB code is On
Smilies are On
[IMG] code is On
HTML code is Off

Forum Jump

Similar Threads
Thread Thread Starter Forum Replies Last Post
Perfect setup SuSe 10.0 - php problem Victor Skoropupob Installation/Configuration 3 19th May 2006 15:07
Problem Installing Courier (The Perfect Setup) regan Installation/Configuration 1 22nd April 2006 22:49
tlsmgr webmail problem, suse 9.3 perfect setup dschmid Installation/Configuration 44 2nd April 2006 18:55
The Perfect Setup - SUSE 9.3/Install apt For SUSE PROBLEM gimhan90 Installation/Configuration 13 27th January 2006 09:34
The perfect Setup Suse 10 RC1 ispconfig won't create postfix users! fatum112 HOWTO-Related Questions 1 14th January 2006 14:25


All times are GMT +2. The time now is 07:25.


Powered by vBulletin® Version 3.8.7
Copyright ©2000 - 2014, vBulletin Solutions, Inc.