Go Back   HowtoForge Forums | HowtoForge - Linux Howtos and Tutorials > ISPConfig 2 > Installation/Configuration

Do you like HowtoForge? Please consider supporting us by becoming a subscriber.
Reply
 
Thread Tools Display Modes
  #1  
Old 30th July 2008, 08:50
webcave webcave is offline
Junior Member
 
Join Date: Jul 2008
Posts: 22
Thanks: 6
Thanked 1 Time in 1 Post
Default CentOS 5.2 Install line 888 fresh install

Hey guys i just followed the whole perfect guide thing and now i get this error on centos 5.2 and ideas?

Code:
---Configuring extensions---

checking whether to enable LIBXML support... yes
checking libxml2 install dir... no
checking for xml2-config path... /usr/bin/xml2-config
checking whether libxml build works... no
configure: error: build test failed.  Please check the config.log for details.
ERROR: Could not configure PHP
cd: error retrieving current directory: getcwd: cannot access parent directories: No such file or directory
mv: cannot stat `binaries/aps.tar.gz': No such file or directory
mv: cannot stat `binaries/spamassassin.tar.gz': No such file or directory
mv: cannot stat `binaries/uudeview.tar.gz': No such file or directory
mv: cannot stat `binaries/clamav.tar.gz': No such file or directory
mv: cannot stat `binaries/cronolog': No such file or directory
mv: cannot stat `binaries/cronosplit': No such file or directory
mv: cannot stat `binaries/ispconfig_tcpserver': No such file or directory
mv: cannot stat `binaries/zip': No such file or directory
mv: cannot stat `binaries/unzip': No such file or directory
tar: spamassassin.tar.gz: Cannot open: No such file or directory
tar: Error is not recoverable: exiting now
tar: Child returned status 2
tar: Error exit delayed from previous errors
mv: cannot stat `spamassassin': No such file or directory
tar: uudeview.tar.gz: Cannot open: No such file or directory
tar: Error is not recoverable: exiting now
tar: Child returned status 2
tar: Error exit delayed from previous errors
mv: cannot stat `uudeview': No such file or directory
tar: clamav.tar.gz: Cannot open: No such file or directory
tar: Error is not recoverable: exiting now
tar: Child returned status 2
tar: Error exit delayed from previous errors
mv: cannot stat `clamav': No such file or directory
tar: aps.tar.gz: Cannot open: No such file or directory
tar: Error is not recoverable: exiting now
tar: Child returned status 2
tar: Error exit delayed from previous errors
./setup2: line 888: ispconfig_tmp/php/bin/php: No such file or directory
ERROR: The PHP binary coming with ISPConfig does not work properly on your system! The installation routine stops here!
[root@server1 install_ispconfig]#
This is CentOS latest as of 3 hours ago 12AM July 30th

CentOS 5.2 64bit

Last edited by webcave; 30th July 2008 at 09:09.
Reply With Quote
Sponsored Links
  #2  
Old 30th July 2008, 14:05
till till is offline
Super Moderator
 
Join Date: Apr 2005
Location: Lüneburg, Germany
Posts: 35,446
Thanks: 813
Thanked 5,216 Times in 4,089 Posts
Default

Please install the libxml2 development package.
__________________
Till Brehm
--
Get ISPConfig support and the ISPConfig 3 manual from ispconfig.org.
Reply With Quote
The Following User Says Thank You to till For This Useful Post:
webcave (1st August 2008)
  #3  
Old 30th July 2008, 18:21
webcave webcave is offline
Junior Member
 
Join Date: Jul 2008
Posts: 22
Thanks: 6
Thanked 1 Time in 1 Post
Default

its already installed

yum install libxml
already installed

yum install libxml-devel
already installed

Last edited by webcave; 30th July 2008 at 22:35.
Reply With Quote
  #4  
Old 30th July 2008, 22:47
webcave webcave is offline
Junior Member
 
Join Date: Jul 2008
Posts: 22
Thanks: 6
Thanked 1 Time in 1 Post
Default

ok i got passed that but now i have another problem

Code:
Configuring extensions
checking whether to enable LIBXML support... yes
checking libxml2 install dir... no
checking for xml2-config path... /usr/bin/xml2-config
checking whether libxml build works... yes
checking for OpenSSL support... yes
checking for Kerberos support... no
checking for DSA_get_default_method in -lssl... no
checking for pkg-config... /usr/bin/pkg-config
checking for OpenSSL version... >= 0.9.6
checking for CRYPTO_free in -lcrypto... no
configure: error: libcrypto not found!
ERROR: Could not configure PHP
cd: error retrieving current directory: getcwd: cannot access parent directories: No such file or directory
mv: cannot stat `binaries/aps.tar.gz': No such file or directory
mv: cannot stat `binaries/spamassassin.tar.gz': No such file or directory
mv: cannot stat `binaries/uudeview.tar.gz': No such file or directory
mv: cannot stat `binaries/clamav.tar.gz': No such file or directory
mv: cannot stat `binaries/cronolog': No such file or directory
mv: cannot stat `binaries/cronosplit': No such file or directory
mv: cannot stat `binaries/ispconfig_tcpserver': No such file or directory
mv: cannot stat `binaries/zip': No such file or directory
mv: cannot stat `binaries/unzip': No such file or directory
tar: spamassassin.tar.gz: Cannot open: No such file or directory
tar: Error is not recoverable: exiting now
tar: Child returned status 2
tar: Error exit delayed from previous errors
mv: cannot stat `spamassassin': No such file or directory
tar: uudeview.tar.gz: Cannot open: No such file or directory
tar: Error is not recoverable: exiting now
tar: Child returned status 2
tar: Error exit delayed from previous errors
mv: cannot stat `uudeview': No such file or directory
tar: clamav.tar.gz: Cannot open: No such file or directory
tar: Error is not recoverable: exiting now
tar: Child returned status 2
tar: Error exit delayed from previous errors
mv: cannot stat `clamav': No such file or directory
tar: aps.tar.gz: Cannot open: No such file or directory
tar: Error is not recoverable: exiting now
tar: Child returned status 2
tar: Error exit delayed from previous errors
./setup2: line 888: ispconfig_tmp/php/bin/php: No such file or directory
ERROR: The PHP binary coming with ISPConfig does not work properly on your system! The installation routine stops here!
[root@server1 install_ispconfig]#
Reply With Quote
  #5  
Old 30th July 2008, 23:17
webcave webcave is offline
Junior Member
 
Join Date: Jul 2008
Posts: 22
Thanks: 6
Thanked 1 Time in 1 Post
Default

got passed that now this

Code:
xecute.lo sapi/apache/sapi_apache.lo sapi/apache/mod_php5.lo sapi/apache/php_apache.lo main/internal_functions.lo -lcrypt -lcrypt -lrt -lmysqlclient -lz -lresolv -lm -ldl -lnsl -lxml2 -lz -lm -lssl -lcrypto -ldl -lz -lxml2 -lz -lm -lssl -lcrypto -ldl -lz -lxml2 -lz -lm -lcrypt -lxml2 -lz -lm -lxml2 -lz -lm -lxml2 -lz -lm -lcrypt  -o libphp5.la
/usr/bin/ld: /usr/local/lib/libz.a(compress.o): relocation R_X86_64_32 against `a local symbol' can not be used when making a shared object; recompile with -fPIC
/usr/local/lib/libz.a: could not read symbols: Bad value
collect2: ld returned 1 exit status
make: *** [libphp5.la] Error 1
ERROR: Could not make PHP
cd: error retrieving current directory: getcwd: cannot access parent directories: No such file or directory
mv: cannot stat `binaries/aps.tar.gz': No such file or directory
mv: cannot stat `binaries/spamassassin.tar.gz': No such file or directory
mv: cannot stat `binaries/uudeview.tar.gz': No such file or directory
mv: cannot stat `binaries/clamav.tar.gz': No such file or directory
mv: cannot stat `binaries/cronolog': No such file or directory
mv: cannot stat `binaries/cronosplit': No such file or directory
mv: cannot stat `binaries/ispconfig_tcpserver': No such file or directory
mv: cannot stat `binaries/zip': No such file or directory
mv: cannot stat `binaries/unzip': No such file or directory
tar: spamassassin.tar.gz: Cannot open: No such file or directory
tar: Error is not recoverable: exiting now
tar: Child returned status 2
tar: Error exit delayed from previous errors
mv: cannot stat `spamassassin': No such file or directory
tar: uudeview.tar.gz: Cannot open: No such file or directory
tar: Error is not recoverable: exiting now
tar: Child returned status 2
tar: Error exit delayed from previous errors
mv: cannot stat `uudeview': No such file or directory
tar: clamav.tar.gz: Cannot open: No such file or directory
tar: Error is not recoverable: exiting now
tar: Child returned status 2
tar: Error exit delayed from previous errors
mv: cannot stat `clamav': No such file or directory
tar: aps.tar.gz: Cannot open: No such file or directory
tar: Error is not recoverable: exiting now
tar: Child returned status 2
tar: Error exit delayed from previous errors
./setup2: line 888: ispconfig_tmp/php/bin/php: No such file or directory
ERROR: The PHP binary coming with ISPConfig does not work properly on your system! The installation routine stops here!
[root@server1 install_ispconfig]#
Reply With Quote
  #6  
Old 31st July 2008, 07:56
till till is offline
Super Moderator
 
Join Date: Apr 2005
Location: Lüneburg, Germany
Posts: 35,446
Thanks: 813
Thanked 5,216 Times in 4,089 Posts
Default

Looks as if you use a 64Bit Kernel and 32Bit Userland or vice versa and the zlib library you installed does not support this.

You should either use 64Bit kernal and userland or 32bit kernel and userland but do not mix it.
__________________
Till Brehm
--
Get ISPConfig support and the ISPConfig 3 manual from ispconfig.org.
Reply With Quote
The Following User Says Thank You to till For This Useful Post:
webcave (1st August 2008)
  #7  
Old 1st August 2008, 03:38
webcave webcave is offline
Junior Member
 
Join Date: Jul 2008
Posts: 22
Thanks: 6
Thanked 1 Time in 1 Post
Default

How would I go about installing the correct one any links on info or do you know?
Reply With Quote
  #8  
Old 1st August 2008, 06:26
webcave webcave is offline
Junior Member
 
Join Date: Jul 2008
Posts: 22
Thanks: 6
Thanked 1 Time in 1 Post
Default

reinstalled centos and it works now this is great thanks for the snappy support till all my thanks to you
Reply With Quote
  #9  
Old 6th August 2008, 20:25
rlcomstock3 rlcomstock3 is offline
Junior Member
 
Join Date: Aug 2008
Posts: 2
Thanks: 0
Thanked 0 Times in 0 Posts
Default Got Past it?

WebCave, or anyone else...

I am having the same problems you did, how did you get past the snaggs?

I get the same exact error message...

I have the libxml2 and libxml2-devel installed
I removed the libxml2.i386 packages (using x86_64)

I feel a little lost
Reply With Quote
  #10  
Old 6th August 2008, 20:53
rlcomstock3 rlcomstock3 is offline
Junior Member
 
Join Date: Aug 2008
Posts: 2
Thanks: 0
Thanked 0 Times in 0 Posts
 
Default

Ran...

yum groupinstall 'Development Tools'
yum groupinstall 'Development Libraries'

and it solved my problems
Reply With Quote
Reply

Bookmarks

Thread Tools
Display Modes

Posting Rules
You may not post new threads
You may not post replies
You may not post attachments
You may not edit your posts

BB code is On
Smilies are On
[IMG] code is On
HTML code is Off

Forum Jump

Similar Threads
Thread Thread Starter Forum Replies Last Post
Postfix delivery problem erebus Installation/Configuration 7 26th June 2014 14:33
Lint test error raulb Server Operation 3 29th May 2008 18:33
Fedora Core 5 Spamassassin (Scalix Install) Viper_iii Installation/Configuration 1 19th September 2007 14:59
Apache2 don't start /var/www/sharedip don't exist Dr.Oetker General 14 6th May 2007 13:15
help on /etc/rc0.d/K20dnsctl -> ../init.d/dnsctl zimele General 13 23rd August 2006 16:06


All times are GMT +2. The time now is 03:17.


Powered by vBulletin® Version 3.8.7
Copyright ©2000 - 2014, vBulletin Solutions, Inc.