#1  
Old 16th February 2008, 17:26
limpkinw limpkinw is offline
Junior Member
 
Join Date: Feb 2008
Posts: 9
Thanks: 1
Thanked 0 Times in 0 Posts
Default Error on install Fiesty

I have followed the perfect setup guide completely with no errors at all. When I go to install I get the following errors.


/tmp/cccyGGWZ.s:435: Error: Incorrect register `%rax' used with `l' suffix
/tmp/cccyGGWZ.s:443: Error: Incorrect register `%rbx' used with `l' suffix
/tmp/cccyGGWZ.s:463: Error: Incorrect register `%rdx' used with `l' suffix
/tmp/cccyGGWZ.s:464: Error: Incorrect register `%rbx' used with `l' suffix
make[1]: *** [s_server.o] Error 1
make[1]: Leaving directory `/root/install_ispconfig/compile_aps/openssl-0.9.7m/apps'
make: *** [sub_all] Error 1
ERROR: Could not make OpenSSL
cd: error retrieving current directory: getcwd: cannot access parent directories: No such file or directory
mv: cannot stat `binaries/aps.tar.gz': No such file or directory
mv: cannot stat `binaries/spamassassin.tar.gz': No such file or directory
mv: cannot stat `binaries/uudeview.tar.gz': No such file or directory
mv: cannot stat `binaries/clamav.tar.gz': No such file or directory
mv: cannot stat `binaries/cronolog': No such file or directory
mv: cannot stat `binaries/cronosplit': No such file or directory
mv: cannot stat `binaries/ispconfig_tcpserver': No such file or directory
mv: cannot stat `binaries/zip': No such file or directory
mv: cannot stat `binaries/unzip': No such file or directory
tar: spamassassin.tar.gz: Cannot open: No such file or directory
tar: Error is not recoverable: exiting now
tar: Child returned status 2
tar: Error exit delayed from previous errors
mv: cannot stat `spamassassin': No such file or directory
tar: uudeview.tar.gz: Cannot open: No such file or directory
tar: Error is not recoverable: exiting now
tar: Child returned status 2
tar: Error exit delayed from previous errors
mv: cannot stat `uudeview': No such file or directory
tar: clamav.tar.gz: Cannot open: No such file or directory
tar: Error is not recoverable: exiting now
tar: Child returned status 2
tar: Error exit delayed from previous errors
mv: cannot stat `clamav': No such file or directory
tar: aps.tar.gz: Cannot open: No such file or directory
tar: Error is not recoverable: exiting now
tar: Child returned status 2
tar: Error exit delayed from previous errors
./setup2: line 873: ispconfig_tmp/php/bin/php: No such file or directory
ERROR: The PHP binary coming with ISPConfig does not work properly on your system! The installation routine stops here!

Thank you in advance
Sponsored Links
  #2  
Old 16th February 2008, 17:55
limpkinw limpkinw is offline
Junior Member
 
Join Date: Feb 2008
Posts: 9
Thanks: 1
Thanked 0 Times in 0 Posts
Default

uname-a output is

Linux zz54-vps338.zzservers.net 2.6.19-4-generic-amd64 #2 SMP Sat Oct 6 01:35:53 UTC 2007 x86_64 GNU/Linux
  #3  
Old 17th February 2008, 16:38
limpkinw limpkinw is offline
Junior Member
 
Join Date: Feb 2008
Posts: 9
Thanks: 1
Thanked 0 Times in 0 Posts
 
Default

please close this thread as I have changed OS refer to
http://www.howtoforge.com/forums/sho...726#post108726
Closed Thread

Bookmarks

Thread Tools
Display Modes

Posting Rules
You may not post new threads
You may not post replies
You may not post attachments
You may not edit your posts

BB code is On
Smilies are On
[IMG] code is On
HTML code is Off

Forum Jump

Similar Threads
Thread Thread Starter Forum Replies Last Post
The Perfect Server - 7.10 Server (PHP5 & PHP5 Packages Install Snag) giganet HOWTO-Related Questions 8 9th December 2008 22:05
problem install perl modules Cirox Installation/Configuration 10 16th May 2007 17:04
VMWare Server Free License - Invalid bardgd HOWTO-Related Questions 6 19th November 2006 18:50
install Net::DNS chrno Installation/Configuration 4 5th September 2006 18:01
Mandriva 10.2 Perfect Setup Install Problems... ctroyp Installation/Configuration 12 30th December 2005 17:04


All times are GMT +2. The time now is 02:22.


Powered by vBulletin® Version 3.8.7
Copyright ©2000 - 2014, vBulletin Solutions, Inc.