#1  
Old 3rd January 2008, 13:38
chua_jose chua_jose is offline
Member
 
Join Date: Nov 2007
Posts: 70
Thanks: 6
Thanked 2 Times in 2 Posts
Question ERROR: Could not make ClamAV

Hello to all, I have installed rhel-x86_64-server-5 and when I do ./setup me the following mistake appears:
Code:
gcc -shared  .libs/matcher-ac.o .libs/matcher-bm.o .libs/matcher-ncore.o .libs/matcher.o .libs/md5.o .libs/others.o .libs/readdb.o .libs/cvd.o .libs/dsig.o .libs/str.o .libs/scanners.o .libs/filetypes.o .libs/rtf.o .libs/blob.o .libs/mbox.o .libs/message.o .libs/snprintf.o .libs/table.o .libs/text.o .libs/ole2_extract.o .libs/vba_extract.o .libs/msexpand.o .libs/pe.o .libs/upx.o .libs/htmlnorm.o .libs/chmunpack.o .libs/rebuildpe.o .libs/petite.o .libs/wwunpack.o .libs/suecrypt.o .libs/unsp.o .libs/aspack.o .libs/packlibs.o .libs/fsg.o .libs/mew.o .libs/upack.o .libs/line.o .libs/untar.o .libs/unzip.o .libs/special.o .libs/binhex.o .libs/is_tar.o .libs/tnef.o .libs/unrar15.o .libs/unrarvm.o .libs/unrar.o .libs/unrarfilter.o .libs/unrarppm.o .libs/unrar20.o .libs/unrarcmd.o .libs/LZMADecode.o .libs/bzlib.o .libs/infblock.o .libs/nulsft.o .libs/pdf.o .libs/spin.o .libs/yc.o .libs/elf.o .libs/sis.o .libs/uuencode.o .libs/phishcheck.o .libs/phish_domaincheck_db.o .libs/phish_whitelist.o .libs/regex_list.o .libs/sha256.o .libs/mspack.o .libs/cab.o .libs/entconv.o .libs/hashtab.o .libs/dconf.o .libs/lockdb.o  -L/usr/local/lib -lz -lpthread -lnsl  -Wl,-soname -Wl,libclamav.so.2 -o .libs/libclamav.so.2.0.8
/usr/bin/ld: /usr/local/lib/libz.a(gzio.o): relocation R_X86_64_32 against `a local symbol' can not be used when making a shared object; recompile with -fPIC
/usr/local/lib/libz.a: could not read symbols: Bad value
collect2: ld returned 1 exit status
make[2]: *** [libclamav.la] Error 1
make[2]: se sale del directorio `/usr/src/install_ispconfig/compile_aps/clamav-0.91.2/libclamav'
make[1]: *** [all-recursive] Error 1
make[1]: se sale del directorio `/usr/src/install_ispconfig/compile_aps/clamav-0.91.2'
make: *** [all] Error 2
ERROR: Could not make ClamAV
cd: error retrieving current directory: getcwd: cannot access parent directories: No existe el fichero o el directorio
mv: no se puede efectuar `stat' sobre «binaries/aps.tar.gz»: No existe el fichero o el directorio
mv: no se puede efectuar `stat' sobre «binaries/spamassassin.tar.gz»: No existe el fichero o el directorio
mv: no se puede efectuar `stat' sobre «binaries/uudeview.tar.gz»: No existe el fichero o el directorio
mv: no se puede efectuar `stat' sobre «binaries/clamav.tar.gz»: No existe el fichero o el directorio
mv: no se puede efectuar `stat' sobre «binaries/cronolog»: No existe el fichero o el directorio
mv: no se puede efectuar `stat' sobre «binaries/cronosplit»: No existe el fichero o el directorio
mv: no se puede efectuar `stat' sobre «binaries/ispconfig_tcpserver»: No existe el fichero o el directorio
mv: no se puede efectuar `stat' sobre «binaries/zip»: No existe el fichero o el directorio
mv: no se puede efectuar `stat' sobre «binaries/unzip»: No existe el fichero o el directorio
tar: spamassassin.tar.gz: No se puede open: No existe el fichero o el directorio
tar: El error no es recuperable: salida ahora
tar: Child returned status 2
tar: Salida con error demorada desde errores anteriores
mv: no se puede efectuar `stat' sobre «spamassassin»: No existe el fichero o el directorio
tar: uudeview.tar.gz: No se puede open: No existe el fichero o el directorio
tar: El error no es recuperable: salida ahora
tar: Child returned status 2
tar: Salida con error demorada desde errores anteriores
mv: no se puede efectuar `stat' sobre «uudeview»: No existe el fichero o el directorio
tar: clamav.tar.gz: No se puede open: No existe el fichero o el directorio
tar: El error no es recuperable: salida ahora
tar: Child returned status 2
tar: Salida con error demorada desde errores anteriores
mv: no se puede efectuar `stat' sobre «clamav»: No existe el fichero o el directorio
tar: aps.tar.gz: No se puede open: No existe el fichero o el directorio
tar: El error no es recuperable: salida ahora
tar: Child returned status 2
tar: Salida con error demorada desde errores anteriores
./setup2: line 873: ispconfig_tmp/php/bin/php: No existe el fichero o el directorio
ERROR: The PHP binary coming with ISPConfig does not work properly on your system! The installation routine stops here!
gcc -shared  .libs/matcher-ac.o .libs/matcher-bm.o .libs/matcher-ncore.o .libs/matcher.o .libs/md5.o .libs/others.o .libs/readdb.o .libs/cvd.o .libs/dsig.o .libs/str.o .libs/scanners.o .libs/filetypes.o .libs/rtf.o .libs/blob.o .libs/mbox.o .libs/message.o .libs/snprintf.o .libs/table.o .libs/text.o .libs/ole2_extract.o .libs/vba_extract.o .libs/msexpand.o .libs/pe.o .libs/upx.o .libs/htmlnorm.o .libs/chmunpack.o .libs/rebuildpe.o .libs/petite.o .libs/wwunpack.o .libs/suecrypt.o .libs/unsp.o .libs/aspack.o .libs/packlibs.o .libs/fsg.o .libs/mew.o .libs/upack.o .libs/line.o .libs/untar.o .libs/unzip.o .libs/special.o .libs/binhex.o .libs/is_tar.o .libs/tnef.o .libs/unrar15.o .libs/unrarvm.o .libs/unrar.o .libs/unrarfilter.o .libs/unrarppm.o .libs/unrar20.o .libs/unrarcmd.o .libs/LZMADecode.o .libs/bzlib.o .libs/infblock.o .libs/nulsft.o .libs/pdf.o .libs/spin.o .libs/yc.o .libs/elf.o .libs/sis.o .libs/uuencode.o .libs/phishcheck.o .libs/phish_domaincheck_db.o .libs/phish_whitelist.o .libs/regex_list.o .libs/sha256.o .libs/mspack.o .libs/cab.o .libs/entconv.o .libs/hashtab.o .libs/dconf.o .libs/lockdb.o  -L/usr/local/lib -lz -lpthread -lnsl  -Wl,-soname -Wl,libclamav.so.2 -o .libs/libclamav.so.2.0.8
/usr/bin/ld: /usr/local/lib/libz.a(gzio.o): relocation R_X86_64_32 against `a local symbol' can not be used when making a shared object; recompile with -fPIC
/usr/local/lib/libz.a: could not read symbols: Bad value
collect2: ld returned 1 exit status
make[2]: *** [libclamav.la] Error 1
make[2]: se sale del directorio `/usr/src/install_ispconfig/compile_aps/clamav-0.91.2/libclamav'
make[1]: *** [all-recursive] Error 1
make[1]: se sale del directorio `/usr/src/install_ispconfig/compile_aps/clamav-0.91.2'
make: *** [all] Error 2
:confused: :confused: 
cd: error retrieving current directory: getcwd: cannot access parent directories: No existe el fichero o el directorio
mv: no se puede efectuar `stat' sobre «binaries/aps.tar.gz»: No existe el fichero o el directorio
mv: no se puede efectuar `stat' sobre «binaries/spamassassin.tar.gz»: No existe el fichero o el directorio
mv: no se puede efectuar `stat' sobre «binaries/uudeview.tar.gz»: No existe el fichero o el directorio
mv: no se puede efectuar `stat' sobre «binaries/clamav.tar.gz»: No existe el fichero o el directorio
mv: no se puede efectuar `stat' sobre «binaries/cronolog»: No existe el fichero o el directorio
mv: no se puede efectuar `stat' sobre «binaries/cronosplit»: No existe el fichero o el directorio
mv: no se puede efectuar `stat' sobre «binaries/ispconfig_tcpserver»: No existe el fichero o el directorio
mv: no se puede efectuar `stat' sobre «binaries/zip»: No existe el fichero o el directorio
mv: no se puede efectuar `stat' sobre «binaries/unzip»: No existe el fichero o el directorio
tar: spamassassin.tar.gz: No se puede open: No existe el fichero o el directorio
tar: El error no es recuperable: salida ahora
tar: Child returned status 2
tar: Salida con error demorada desde errores anteriores
mv: no se puede efectuar `stat' sobre «spamassassin»: No existe el fichero o el directorio
tar: uudeview.tar.gz: No se puede open: No existe el fichero o el directorio
tar: El error no es recuperable: salida ahora
tar: Child returned status 2
tar: Salida con error demorada desde errores anteriores
mv: no se puede efectuar `stat' sobre «uudeview»: No existe el fichero o el directorio
tar: clamav.tar.gz: No se puede open: No existe el fichero o el directorio
tar: El error no es recuperable: salida ahora
tar: Child returned status 2
tar: Salida con error demorada desde errores anteriores
mv: no se puede efectuar `stat' sobre «clamav»: No existe el fichero o el directorio
tar: aps.tar.gz: No se puede open: No existe el fichero o el directorio
tar: El error no es recuperable: salida ahora
tar: Child returned status 2
tar: Salida con error demorada desde errores anteriores
./setup2: line 873: ispconfig_tmp/php/bin/php: No existe el fichero o el directorio
ERROR: The PHP binary coming with ISPConfig does not work properly on your system! The installation routine stops here!
I have installed zlib and zlib-devel.
I used guia perfert setup Centos 5.
Reply With Quote
Sponsored Links
  #2  
Old 3rd January 2008, 16:47
chua_jose chua_jose is offline
Member
 
Join Date: Nov 2007
Posts: 70
Thanks: 6
Thanked 2 Times in 2 Posts
 
Default

all ok
thanks

ln -s /usr/lib /usr/lib64

Reply With Quote
Reply

Bookmarks

Thread Tools
Display Modes

Posting Rules
You may not post new threads
You may not post replies
You may not post attachments
You may not edit your posts

BB code is On
Smilies are On
[IMG] code is On
HTML code is Off

Forum Jump

Similar Threads
Thread Thread Starter Forum Replies Last Post
ClamAV update to 0.90 made easy? rbartz Tips/Tricks/Mods 35 10th April 2008 11:11
clamav spamassassin with simscan @ debian Shamael Anwar Installation/Configuration 2 15th December 2006 20:06
install Net::DNS chrno Installation/Configuration 4 5th September 2006 17:01
Clamav starting error scherpenzeel Installation/Configuration 3 19th May 2006 14:01
FC3 Perfect Installation Make Errors solderboy HOWTO-Related Questions 3 2nd October 2005 16:55


All times are GMT +2. The time now is 18:02.


Powered by vBulletin® Version 3.8.7
Copyright ©2000 - 2014, vBulletin Solutions, Inc.