#1  
Old 15th January 2006, 16:26
cyberstorm cyberstorm is offline
Junior Member
 
Join Date: Jan 2006
Posts: 1
Thanks: 0
Thanked 0 Times in 0 Posts
Default Installation Fails... :(

Hello,

in advance, sorry for my bad english, im a german one

I have tried to install ISPConfig instead Mandriva 2006. The Howto of Howtoforge.com helps me great. All working fine, but i think the ISPConfig doesnt like me

I paste the working progress here:


/usr/include/tk.h:96:23: error: X11/Xlib.h: Datei oder Verzeichnis nicht gefunden
In file included from uuwish.c:33:
/usr/include/tk.h:572: error: syntax error before 'Window'
/usr/include/tk.h:572: error: 'Window' declared as function returning a function
/usr/include/tk.h:575: error: syntax error before 'XEvent'
/usr/include/tk.h:584: error: syntax error before 'Tk_ClassCreateProc'
/usr/include/tk.h:592: error: syntax error before '}' token
/usr/include/tk.h:678: error: syntax error before 'Bool'
/usr/include/tk.h:683: error: syntax error before 'time'
/usr/include/tk.h:688: error: syntax error before 'same_screen'
/usr/include/tk.h:694: error: syntax error before 'Bool'
/usr/include/tk.h:697: error: syntax error before '}' token
/usr/include/tk.h:698: error: syntax error before 'XActivateEvent'
/usr/include/tk.h:699: error: syntax error before 'XDeactivateEvent'
/usr/include/tk.h:771: error: syntax error before 'Display'
/usr/include/tk.h:774: error: syntax error before '*' token
/usr/include/tk.h:785: error: syntax error before 'changes'
/usr/include/tk.h:787: error: syntax error before 'atts'
/usr/include/tk.h:811: error: syntax error before '}' token
/usr/include/tk.h:921: error: syntax error before 'XPoint'
/usr/include/tk.h:1022: error: syntax error before 'Display'
/usr/include/tk.h:1024: error: syntax error before 'Display'
/usr/include/tk.h:1121: error: syntax error before 'XColor'
/usr/include/tk.h:1151: error: syntax error before '}' token
/usr/include/tk.h:1185: error: syntax error before 'GC'
/usr/include/tk.h:1197: error: syntax error before '*' token
/usr/include/tk.h:1198: error: syntax error before '*' token
/usr/include/tk.h:1199: error: syntax error before '*' token
/usr/include/tk.h:1200: error: syntax error before 'stipple'
/usr/include/tk.h:1201: error: syntax error before 'activeStipple'
/usr/include/tk.h:1202: error: syntax error before 'disabledStipple'
/usr/include/tk.h:1226: error: syntax error before 'Display'
/usr/include/tk.h:1229: error: syntax error before 'Display'
/usr/include/tk.h:1434: error: syntax error before 'Drawable'
/usr/include/tk.h:1551: error: syntax error before 'XErrorEvent'
/usr/include/tk.h:1553: error: syntax error before 'XEvent'
/usr/include/tk.h:1555: error: syntax error before 'XEvent'
/usr/include/tk.h:1557: error: syntax error before 'XEvent'
/usr/include/tk.h:1562: error: syntax error before 'XEvent'
In file included from /usr/include/tk.h:1576,
from uuwish.c:33:

.... and so on ... and so on...

make[1]: *** [uuwish.o] Fehler 1
make[1]: Leaving directory `/root/Download/install_ispconfig/compile_aps/uudeview-0.5.20/tcl'
make: *** [xdeview] Fehler 2
ERROR: Could not make UUDeview
cd: error retrieving current directory: getcwd: cannot access parent directories: Datei oder Verzeichnis nicht gefunden
mv: Aufruf von stat für ,,binaries/aps.tar.gz" nicht möglich: Datei oder Verzeichnis nicht gefunden
mv: Aufruf von stat für ,,binaries/spamassassin.tar.gz" nicht möglich: Datei oder Verzeichnis nicht gefunden
mv: Aufruf von stat für ,,binaries/uudeview.tar.gz" nicht möglich: Datei oder Verzeichnis nicht gefunden
mv: Aufruf von stat für ,,binaries/clamav.tar.gz" nicht möglich: Datei oder Verzeichnis nicht gefunden
mv: Aufruf von stat für ,,binaries/cronolog" nicht möglich: Datei oder Verzeichnis nicht gefunden
mv: Aufruf von stat für ,,binaries/cronosplit" nicht möglich: Datei oder Verzeichnis nicht gefunden
mv: Aufruf von stat für ,,binaries/ispconfig_tcpserver" nicht möglich: Datei oder Verzeichnis nicht gefunden
mv: Aufruf von stat für ,,binaries/zip" nicht möglich: Datei oder Verzeichnis nicht gefunden
mv: Aufruf von stat für ,,binaries/unzip" nicht möglich: Datei oder Verzeichnis nicht gefunden
tar: spamassassin.tar.gz: Kann open nicht ausführen.: Datei oder Verzeichnis nicht gefunden
tar: Nicht behebbarer Fehler: Programmabbruch.
tar: Child returned status 2
tar: Fehler beim Beenden, verursacht durch vorhergehende Fehler.
mv: Aufruf von stat für ,,spamassassin" nicht möglich: Datei oder Verzeichnis nicht gefunden
tar: uudeview.tar.gz: Kann open nicht ausführen.: Datei oder Verzeichnis nicht gefunden
tar: Nicht behebbarer Fehler: Programmabbruch.
tar: Child returned status 2
tar: Fehler beim Beenden, verursacht durch vorhergehende Fehler.
mv: Aufruf von stat für ,,uudeview" nicht möglich: Datei oder Verzeichnis nicht gefunden
tar: clamav.tar.gz: Kann open nicht ausführen.: Datei oder Verzeichnis nicht gefunden
tar: Nicht behebbarer Fehler: Programmabbruch.
tar: Child returned status 2
tar: Fehler beim Beenden, verursacht durch vorhergehende Fehler.
mv: Aufruf von stat für ,,clamav" nicht möglich: Datei oder Verzeichnis nicht gefunden
tar: aps.tar.gz: Kann open nicht ausführen.: Datei oder Verzeichnis nicht gefunden
tar: Nicht behebbarer Fehler: Programmabbruch.
tar: Child returned status 2
tar: Fehler beim Beenden, verursacht durch vorhergehende Fehler.
./setup2: line 771: ispconfig_tmp/php/bin/php: Datei oder Verzeichnis nicht gefunden
ERROR: Das mitgelieferte PHP-Binary funktioniert auf Ihrem System nicht! Die Installation bricht hier ab!

Hopefully waiting for littlebit help...

Greets
Reply With Quote
Sponsored Links
  #2  
Old 15th January 2006, 18:07
falko falko is offline
Super Moderator
 
Join Date: Apr 2005
Location: Lüneburg, Germany
Posts: 41,711
Thanks: 1,900
Thanked 2,703 Times in 2,546 Posts
 
Default

Quote:
Originally Posted by cyberstorm
/usr/include/tk.h:96:23: error: X11/Xlib.h: Datei oder Verzeichnis nicht gefunden
You forgot to install the package libxorg-x11-devel. It's mentioned on http://www.howtoforge.com/perfect_se...driva_2006_p4:

Code:
urpmi fetchmail wget bzip2 unzip zip nmap openssl lynx fileutils ncftp flex libxorg-x11-devel
Run
Code:
urpmi libxorg-x11-devel
and try to install ISPConfig again. Before you do so, make sure you remove the directories /root/ispconfig and /home/admispconfig (if they exist); also delete install_ispconfig and unpack the ISPConfig tarball again.
__________________
Falko
--
Download the ISPConfig 3 Manual! | Check out the ISPConfig 3 Billing Module!

FB: http://www.facebook.com/howtoforge

nginx-Webhosting: Timme Hosting | Follow me on:
Reply With Quote
Reply

Bookmarks

Thread Tools
Display Modes

Posting Rules
You may not post new threads
You may not post replies
You may not post attachments
You may not edit your posts

BB code is On
Smilies are On
[IMG] code is On
HTML code is Off

Forum Jump

Similar Threads
Thread Thread Starter Forum Replies Last Post
Installation Coldfusion error misterm Installation/Configuration 1 15th January 2006 19:06
ISPconfig 2.0.9 fails on openSuse 10 rc1 AlexCunha Installation/Configuration 3 27th September 2005 04:23
Problems getting through the installation klausagnoletti Installation/Configuration 4 26th September 2005 12:23
mysql password during installation Hellbound Installation/Configuration 4 21st September 2005 18:52
Trouble with Installation. cjkeeme Installation/Configuration 3 3rd August 2005 18:46


All times are GMT +2. The time now is 04:51.


Powered by vBulletin® Version 3.8.7
Copyright ©2000 - 2014, vBulletin Solutions, Inc.