Go Back   HowtoForge Forums | HowtoForge - Linux Howtos and Tutorials > ISPConfig 2 > Installation/Configuration

Do you like HowtoForge? Please consider supporting us by becoming a subscriber.
Reply
 
Thread Tools Display Modes
  #1  
Old 25th April 2007, 15:17
NexusTechUS NexusTechUS is offline
Junior Member
 
Join Date: Apr 2007
Posts: 1
Thanks: 0
Thanked 0 Times in 0 Posts
Default SuSE Enterprise, PHP binary coming with ISPConfig does not work properly

I have tried several things to get through this install. I am running this from /tmp, per what I have read on this forum. I have also installed openssl.

df -h produces the following:

Quote:
Filesystem Size Used Avail Use% Mounted on
/dev/sda2 16G 1.9G 15G 12% /
udev 380M 100K 380M 1% /dev
/dev/sdb1 17G 20K 16G 1% /srv/www/htdocs
The error is as follows:

Quote:
zipup.c:219: warning: incompatible implicit declaration of built-in function ‚strlen‚
zipup.c: In function ‚zipup‚:
zipup.c:302: warning: incompatible implicit declaration of built-in function ‚strlen‚
zipup.c:558: warning: incompatible implicit declaration of built-in function ‚malloc‚
cc -c -O2 -I. -DUNIX -DASMV -DASM_CRC -DNO_STRCHR -DNO_STRRCHR -DNO_STDLIB_H -DNO_STDDEF_H -DNO_UNISTD_H -DNO_FCNTL_H -DNO_STRING_H -DHAVE_TERMIOS_H fileio.c
fileio.c: In function ‚check_dup‚:
fileio.c:239: warning: incompatible implicit declaration of built-in function ‚malloc‚
fileio.c: In function ‚newname‚:
fileio.c:383: warning: incompatible implicit declaration of built-in function ‚malloc‚
fileio.c:383: warning: incompatible implicit declaration of built-in function ‚strlen‚
fileio.c:390: warning: incompatible implicit declaration of built-in function ‚strcpy‚
fileio.c:450: warning: incompatible implicit declaration of built-in function ‚malloc‚
fileio.c:452: warning: incompatible implicit declaration of built-in function ‚strlen‚
fileio.c:462: warning: incompatible implicit declaration of built-in function ‚strcpy‚
fileio.c: In function ‚tempname‚:
fileio.c:814: warning: incompatible implicit declaration of built-in function ‚malloc‚
fileio.c:814: warning: incompatible implicit declaration of built-in function ‚strlen‚
fileio.c:816: warning: incompatible implicit declaration of built-in function ‚strcpy‚
fileio.c:841: warning: incompatible implicit declaration of built-in function ‚strcat‚
fileio.c:850: warning: incompatible implicit declaration of built-in function ‚malloc‚
fileio.c:861: warning: incompatible implicit declaration of built-in function ‚strcat‚
fileio.c: In function ‚fcopy‚:
fileio.c:879: warning: incompatible implicit declaration of built-in function ‚malloc‚
cc -c -O2 -I. -DUNIX -DASMV -DASM_CRC -DNO_STRCHR -DNO_STRRCHR -DNO_STDLIB_H -DNO_STDDEF_H -DNO_UNISTD_H -DNO_FCNTL_H -DNO_STRING_H -DHAVE_TERMIOS_H util.c
util.c: In function ‚envargs‚:
util.c:492: warning: incompatible implicit declaration of built-in function ‚malloc‚
util.c:492: warning: incompatible implicit declaration of built-in function ‚strlen‚
util.c:495: warning: incompatible implicit declaration of built-in function ‚strcpy‚
cc -c -O2 -I. -DUNIX -DASMV -DASM_CRC -DNO_STRCHR -DNO_STRRCHR -DNO_STDLIB_H -DNO_STDDEF_H -DNO_UNISTD_H -DNO_FCNTL_H -DNO_STRING_H -DHAVE_TERMIOS_H globals.c
cc -c -O2 -I. -DUNIX -DASMV -DASM_CRC -DNO_STRCHR -DNO_STRRCHR -DNO_STDLIB_H -DNO_STDDEF_H -DNO_UNISTD_H -DNO_FCNTL_H -DNO_STRING_H -DHAVE_TERMIOS_H crypt.c
cc -c -O2 -I. -DUNIX -DASMV -DASM_CRC -DNO_STRCHR -DNO_STRRCHR -DNO_STDLIB_H -DNO_STDDEF_H -DNO_UNISTD_H -DNO_FCNTL_H -DNO_STRING_H -DHAVE_TERMIOS_H ttyio.c
cc -c -O2 -I. -DUNIX -DASMV -DASM_CRC -DNO_STRCHR -DNO_STRRCHR -DNO_STDLIB_H -DNO_STDDEF_H -DNO_UNISTD_H -DNO_FCNTL_H -DNO_STRING_H -DHAVE_TERMIOS_H unix/unix.c
unix/unix.c:60: error: expected ‚)‚ before ‚*‚ token
unix/unix.c: In function ‚readd‚:
unix/unix.c:95: error: expected declaration specifiers before ‚DIR‚
unix/unix.c:101: warning: assignment makes pointer from integer without a cast
unix/unix.c:102: error: dereferencing pointer to incomplete type
unix/unix.c: In function ‚procname‚:
unix/unix.c:112: error: ‚DIR‚ undeclared (first use in this function)
unix/unix.c:112: error: (Each undeclared identifier is reported only once
unix/unix.c:112: error: for each function it appears in.)
unix/unix.c:112: error: ‚d‚ undeclared (first use in this function)
unix/unix.c:159: warning: incompatible implicit declaration of built-in function ‚malloc‚
unix/unix.c:159: warning: incompatible implicit declaration of built-in function ‚strlen‚
unix/unix.c:164: warning: incompatible implicit declaration of built-in function ‚strcpy‚
unix/unix.c:185: warning: incompatible implicit declaration of built-in function ‚strcat‚
unix/unix.c:185: warning: incompatible implicit declaration of built-in function ‚strcpy‚
unix/unix.c: In function ‚ex2in‚:
unix/unix.c:243: warning: incompatible implicit declaration of built-in function ‚malloc‚
unix/unix.c:243: warning: incompatible implicit declaration of built-in function ‚strlen‚
unix/unix.c:245: warning: incompatible implicit declaration of built-in function ‚strcpy‚
unix/unix.c: In function ‚in2ex‚:
unix/unix.c:269: warning: incompatible implicit declaration of built-in function ‚malloc‚
unix/unix.c:269: warning: incompatible implicit declaration of built-in function ‚strlen‚
unix/unix.c:274: warning: incompatible implicit declaration of built-in function ‚strcpy‚
unix/unix.c: In function ‚filetime‚:
unix/unix.c:323: warning: incompatible implicit declaration of built-in function ‚strlen‚
unix/unix.c:334: warning: incompatible implicit declaration of built-in function ‚strcpy‚
unix/unix.c: In function ‚set_extra_field‚:
unix/unix.c:426: warning: incompatible implicit declaration of built-in function ‚malloc‚
unix/unix.c:454: warning: incompatible implicit declaration of built-in function ‚memcpy‚
make[1]: *** [unix.o] Error 1
make[1]: Leaving directory `/tmp/install_ispconfig/compile_aps/zip-2.3'
make: *** [generic] Error 2
ERROR: Could not make zip
cd: error retrieving current directory: getcwd: cannot access parent directories: No such file or directory
mv: cannot stat `binaries/aps.tar.gz': No such file or directory
mv: cannot stat `binaries/spamassassin.tar.gz': No such file or directory
mv: cannot stat `binaries/uudeview.tar.gz': No such file or directory
mv: cannot stat `binaries/clamav.tar.gz': No such file or directory
mv: cannot stat `binaries/cronolog': No such file or directory
mv: cannot stat `binaries/cronosplit': No such file or directory
mv: cannot stat `binaries/ispconfig_tcpserver': No such file or directory
mv: cannot stat `binaries/zip': No such file or directory
mv: cannot stat `binaries/unzip': No such file or directory
tar: spamassassin.tar.gz: Cannot open: No such file or directory
tar: Error is not recoverable: exiting now
tar: Child returned status 2
tar: Error exit delayed from previous errors
mv: cannot stat `spamassassin': No such file or directory
tar: uudeview.tar.gz: Cannot open: No such file or directory
tar: Error is not recoverable: exiting now
tar: Child returned status 2
tar: Error exit delayed from previous errors
mv: cannot stat `uudeview': No such file or directory
tar: clamav.tar.gz: Cannot open: No such file or directory
tar: Error is not recoverable: exiting now
tar: Child returned status 2
tar: Error exit delayed from previous errors
mv: cannot stat `clamav': No such file or directory
tar: aps.tar.gz: Cannot open: No such file or directory
tar: Error is not recoverable: exiting now
tar: Child returned status 2
tar: Error exit delayed from previous errors
./setup2: line 862: ispconfig_tmp/php/bin/php: No such file or directory
ERROR: The PHP binary coming with ISPConfig does not work properly on your system! The installation routine stops here!
Thanks for any help you might be able to provide!
Reply With Quote
Sponsored Links
  #2  
Old 26th April 2007, 20:03
falko falko is offline
Super Moderator
 
Join Date: Apr 2005
Location: LŁneburg, Germany
Posts: 41,701
Thanks: 1,900
Thanked 2,722 Times in 2,563 Posts
 
Default

I'm not sure what causes the error... Is it a 32 or 64bit SuSE?
On the other hand, SLES is not supported by ISPConfig.
__________________
Falko
--
Download the ISPConfig 3 Manual! | Check out the ISPConfig 3 Billing Module!

FB: http://www.facebook.com/howtoforge

nginx-Webhosting: Timme Hosting | Follow me on:
Reply With Quote
Reply

Bookmarks

Thread Tools
Display Modes

Posting Rules
You may not post new threads
You may not post replies
You may not post attachments
You may not edit your posts

BB code is On
Smilies are On
[IMG] code is On
HTML code is Off

Forum Jump

Similar Threads
Thread Thread Starter Forum Replies Last Post
ERROR: The PHP binary coming with ISPConfig does not work properly on your system! qvindesland Installation/Configuration 22 21st May 2007 16:05
Problem installing ISPconfig - PHP Binary error Danielss89 Installation/Configuration 3 10th January 2007 15:10
The PHP binary coming with ISPConfig does not work properly on your system! DreamState Installation/Configuration 15 22nd October 2006 06:31
"s3_pkt.c:795" leads to "ERROR: The PHP binary coming with ISPConfig does not work" xavier Installation/Configuration 3 9th October 2006 22:50
VirtualHosts marra87 General 9 12th September 2006 04:09


All times are GMT +2. The time now is 10:50.


Powered by vBulletin® Version 3.8.7
Copyright ©2000 - 2014, vBulletin Solutions, Inc.