Go Back   HowtoForge Forums | HowtoForge - Linux Howtos and Tutorials > ISPConfig 2 > Installation/Configuration

Do you like HowtoForge? Please consider supporting us by becoming a subscriber.
 
 
Thread Tools Display Modes
Prev Previous Post   Next Post Next
  #1  
Old 24th May 2007, 22:51
alpha-z alpha-z is offline
Junior Member
 
Join Date: May 2007
Posts: 3
Thanks: 0
Thanked 0 Times in 0 Posts
Default Please Help. with install on ubuntu

Hi i've been trying to install ISPConfig on the newest version of Ubunto Server, and i've ran into a few problems but i've gotten past them now, but i've now hit a road block. like no matter what i do it keeps giving me the error, i've tried deleting all those directory at /root and /home.

still giving me error. heres the log.
Thanks for any help anyone can give

25_spf.cf 25_textcat.cf 25_uribl.cf 30_text_de.cf 30_text_fr.cf 30_text_it.cf 30_text_nl.cf 30_text_pl.cf 30_text_pt_br.cf 50_scores.cf 60_awl.cf 60_shortcircuit.cf 60_whitelist.cf 60_whitelist_dk.cf 60_whitelist_dkim.cf 60_whitelist_spf.cf 60_whitelist_subject.cf 72_active.cf user_prefs.template languages sa-update-pubkey.txt
chmod 755 /home/admispconfig/ispconfig/tools/spamassassin/usr/share/spamassassin
creating cache ./config.cache
checking for gcc... gcc
checking whether the C compiler (gcc ) works... yes
checking whether the C compiler (gcc ) is a cross-compiler... no
checking whether we are using GNU C... yes
checking whether gcc accepts -g... yes
checking how to run the C preprocessor... gcc -E
checking if the compiler supports function prototypes... yes
checking whether make sets ${MAKE}... yes
checking for ranlib... ranlib
checking whether ln -s works... yes
checking for tclConfig.sh... not found
configure: warning: Tcl parts disabled
configure: warning: use --enable-tcl to locate tclConfig.sh
checking for sin... no
checking for connect... yes
checking for gethostbyname... yes
checking for sendmail... /usr/sbin/sendmail
checking for inews... no
checking for news server... not found
checking for hostname... /bin/hostname
checking domain name... saturn
centra.ca
checking directory separator... /
checking for ANSI C header files... no
checking for size_t... yes
checking for ANSI C header files... (cached) no
checking whether time.h and sys/time.h may both be included... no
checking for fcntl.h... yes
checking for unistd.h... yes
checking for memory.h... yes
checking for malloc.h... yes
checking for errno.h... yes
checking for direct.h... no
checking for io.h... no
checking for sys/time.h... yes
checking for getcwd... no
checking for popen... no
checking for gettimeofday... no
checking for isatty... no
checking for tempnam... no
checking for strerror... no
checking for stdin... no
checking for stdarg.h... yes
checking for varargs.h... no
checking for pwd.h... yes
checking version number... 0.5pl20
updating cache ./config.cache
creating ./config.status
creating Makefile
creating tcl/Makefile
creating unix/Makefile
creating uulib/Makefile
creating config.h
(cd unix; rm -f config.h ; ln -s ../config.h config.h)
(cd uulib; rm -f config.h ; ln -s ../config.h config.h)
(cd uulib ; make)
make[1]: Entering directory `/tmp/install_ispconfig/compile_aps/uudeview-0.5.20/uulib'
gcc -c -g -O2 -I. -DHAVE_CONFIG_H -DVERSION=\"0.5\" -DPATCH=\"20\" uulib.c
In file included from uulib.c:81:
./fptools.h:54: error: conflicting types for ‚_FP_tempnam‚
/usr/include/stdio.h:202: error: previous declaration of ‚_FP_tempnam‚ was here
uulib.c: In function ‚UUMessage‚:
uulib.c:288: warning: incompatible implicit declaration of built-in function ‚strlen‚
uulib.c:292: warning: incompatible implicit declaration of built-in function ‚strlen‚
uulib.c: In function ‚UUInitialize‚:
uulib.c:373: warning: incompatible implicit declaration of built-in function ‚memset‚
uulib.c:390: warning: incompatible implicit declaration of built-in function ‚malloc‚
uulib.c: In function ‚UUGetOption‚:
uulib.c:467: warning: incompatible implicit declaration of built-in function ‚memcpy‚
uulib.c: In function ‚UULoadFileWithPartNo‚:
uulib.c:692: warning: incompatible implicit declaration of built-in function ‚malloc‚
uulib.c:698: warning: incompatible implicit declaration of built-in function ‚strlen‚
uulib.c:714: warning: incompatible implicit declaration of built-in function ‚strlen‚
uulib.c: In function ‚UUDecodeFile‚:
uulib.c:929: warning: incompatible implicit declaration of built-in function ‚strcpy‚
uulib.c:960: warning: incompatible implicit declaration of built-in function ‚strlen‚
uulib.c: In function ‚UUCleanUp‚:
uulib.c:1253: warning: incompatible implicit declaration of built-in function ‚memset‚
make[1]: *** [uulib.o] Error 1
make[1]: Leaving directory `/tmp/install_ispconfig/compile_aps/uudeview-0.5.20/uulib'
make: *** [libuu.a] Error 2
ERROR: Could not make UUDeview
cd: error retrieving current directory: getcwd: cannot access parent directories: No such file or directory
mv: cannot stat `binaries/aps.tar.gz': No such file or directory
mv: cannot stat `binaries/spamassassin.tar.gz': No such file or directory
mv: cannot stat `binaries/uudeview.tar.gz': No such file or directory
mv: cannot stat `binaries/clamav.tar.gz': No such file or directory
mv: cannot stat `binaries/cronolog': No such file or directory
mv: cannot stat `binaries/cronosplit': No such file or directory
mv: cannot stat `binaries/ispconfig_tcpserver': No such file or directory
mv: cannot stat `binaries/zip': No such file or directory
mv: cannot stat `binaries/unzip': No such file or directory
tar: spamassassin.tar.gz: Cannot open: No such file or directory
tar: Error is not recoverable: exiting now
tar: Child returned status 2
tar: Error exit delayed from previous errors
mv: cannot stat `spamassassin': No such file or directory
tar: uudeview.tar.gz: Cannot open: No such file or directory
tar: Error is not recoverable: exiting now
tar: Child returned status 2
tar: Error exit delayed from previous errors
mv: cannot stat `uudeview': No such file or directory
tar: clamav.tar.gz: Cannot open: No such file or directory
tar: Error is not recoverable: exiting now
tar: Child returned status 2
tar: Error exit delayed from previous errors
mv: cannot stat `clamav': No such file or directory
tar: aps.tar.gz: Cannot open: No such file or directory
tar: Error is not recoverable: exiting now
tar: Child returned status 2
tar: Error exit delayed from previous errors
./setup2: line 873: ispconfig_tmp/php/bin/php: No such file or directory
ERROR: The PHP binary coming with ISPConfig does not work properly on your system! The installation routine stops here!
Reply With Quote
Sponsored Links
 

Bookmarks

Thread Tools
Display Modes

Posting Rules
You may not post new threads
You may not post replies
You may not post attachments
You may not edit your posts

BB code is On
Smilies are On
[IMG] code is On
HTML code is Off

Forum Jump

Similar Threads
Thread Thread Starter Forum Replies Last Post
Couple of questions about Ubuntu Vmware install kokpelli Installation/Configuration 3 27th December 2006 13:57
Log for Debugging jwan Installation/Configuration 5 27th October 2006 14:34
Can't find 'make' on new Ubuntu install Arachne Kernel Questions 10 10th August 2006 21:32
How To ISP install (Ubuntu 5.10 / Fedora 5) DVS Installation/Configuration 4 21st May 2006 15:08
Xen Ubuntu VM Install Question witless1 HOWTO-Related Questions 5 3rd May 2006 15:42


All times are GMT +2. The time now is 04:35.


Powered by vBulletin® Version 3.8.7
Copyright ©2000 - 2014, vBulletin Solutions, Inc.