#1  
Old 21st February 2007, 09:22
yogi183 yogi183 is offline
Junior Member
 
Join Date: Feb 2007
Posts: 4
Thanks: 0
Thanked 1 Time in 1 Post
Default Installation Error, Debian 3.1

hey i've tried installing ISPconfig on both ubuntu and debian, using the HotToForge guides, and following them exactly.

Currently at the point of installing ISPConfig in the Perfect Debian Setup http://www.howtoforge.com/perfect_setup_debian_sarge
this is the error i get

Quote:
ERMIO -O3 -fomit-frame-pointer -Wall -DOPENSSL_BN_ASM_PART_WORDS -DOPENSSL_IA32_SSE2 -DSHA1_ASM -DMD5_ASM -DRMD160_ASM -DAES_ASM -c -o sha512.o sha512.c
sha512.c: In function `sha512_block':
sha512.c:490: error: unrecognizable insn:
(insn 4983 4982 432 3 (nil) (set (reg 0 eax)
(subreg:SI (memI (plus:SI (reg/f:SI 7 esp)
(const_int 6208 [0x1840])) [105 S8 A8]) 0)) -1 (nil)
(nil))
sha512.c:490: internal compiler error: in extract_insn, at recog.c:2175
Please submit a full bug report,
with preprocessed source if appropriate.
See <URL:http://gcc.gnu.org/bugs.html> for instructions.
For Debian GNU/Linux specific bug reporting instructions, see
<URL:file:///usr/share/doc/gcc-3.3/README.Bugs>.
make[2]: *** [sha512.o] Error 1
make[2]: Leaving directory `/install_ispconfig/compile_aps/openssl-0.9.8a/crypto/sha'
make[1]: *** [subdirs] Error 1
make[1]: Leaving directory `/install_ispconfig/compile_aps/openssl-0.9.8a/crypto'
make: *** [build_crypto] Error 1
ERROR: Could not make OpenSSL
cd: could not get current directory: getcwd: cannot access parent directories: No such file or directory
cd: could not get current directory: getcwd: cannot access parent directories: No such file or directory
mv: cannot stat `binaries/aps.tar.gz'job-working-directory: could not get current directory: getcwd: cannot access parent directories: No such file or directory
: No such file or directory
mv: cannot stat `binaries/spamassassin.tar.gz'job-working-directory: could not get current directory: getcwd: cannot access parent directories: No such file or directory
: No such file or directory
job-working-directory: could not get current directory: getcwd: cannot access parent directories: No such file or directory
mv: cannot stat `binaries/uudeview.tar.gz': No such file or directory
mv: cannot stat `binaries/clamav.tar.gz': No such file or directory
job-working-directory: could not get current directory: getcwd: cannot access parent directories: No such file or directory
mv: cannot stat `binaries/cronolog': No such file or directory
job-working-directory: could not get current directory: getcwd: cannot access parent directories: No such file or directory
mv: cannot stat `binaries/cronosplit': No such file or directory
job-working-directory: could not get current directory: getcwd: cannot access parent directories: No such file or directory
mv: cannot stat `binaries/ispconfig_tcpserver': No such file or directory
job-working-directory: could not get current directory: getcwd: cannot access parent directories: No such file or directory
mv: cannot stat `binaries/zip': No such file or directory
job-working-directory: could not get current directory: getcwd: cannot access parent directories: No such file or directory
mv: cannot stat `binaries/unzip': No such file or directory
job-working-directory: could not get current directory: getcwd: cannot access parent directories: No such file or directory
tar: spamassassin.tar.gz: Cannot open: No such file or directory
tar: Error is not recoverable: exiting now
tar: Child returned status 2
tar: Error exit delayed from previous errors
job-working-directory: could not get current directory: getcwd: cannot access parent directories: No such file or directory
mv: cannot stat `spamassassin': No such file or directory
job-working-directory: could not get current directory: getcwd: cannot access parent directories: No such file or directory
tar: uudeview.tar.gz: Cannot open: No such file or directory
tar: Error is not recoverable: exiting now
tar: Child returned status 2
tar: Error exit delayed from previous errors
job-working-directory: could not get current directory: getcwd: cannot access parent directories: No such file or directory
mv: cannot stat `uudeview': No such file or directory
job-working-directory: could not get current directory: getcwd: cannot access parent directories: No such file or directory
tar: clamav.tar.gz: Cannot openjob-working-directory: could not get current directory: getcwd: cannot access parent directories: No such file or directory
: No such file or directory
tar: Error is not recoverable: exiting now
tar: Child returned status 2
tar: Error exit delayed from previous errors
mv: cannot stat `clamav'job-working-directory: could not get current directory: getcwd: cannot access parent directories: No such file or directory
: No such file or directory
job-working-directory: could not get current directory: getcwd: cannot access parent directories: No such file or directory
tar: aps.tar.gz: Cannot open: No such file or directory
tar: Error is not recoverable: exiting now
tar: Child returned status 2
tar: Error exit delayed from previous errors
job-working-directory: could not get current directory: getcwd: cannot access parent directories: No such file or directory
./setup2: line 794: ispconfig_tmp/php/bin/php: No such file or directory
ERROR: The PHP binary coming with ISPConfig does not work properly on your system! The installation routine stops here!
job-working-directory: could not get current directory: getcwd: cannot access parent directories: No such file or directory
any help would be greatly appreciated. Thank you in advance
Reply With Quote
Sponsored Links
  #2  
Old 21st February 2007, 10:03
till till is offline
Super Moderator
 
Join Date: Apr 2005
Location: Lüneburg, Germany
Posts: 36,065
Thanks: 826
Thanked 5,395 Times in 4,239 Posts
Default

Is this a x86 or x86_64 linux?
__________________
Till Brehm
--
Get ISPConfig support and the ISPConfig 3 manual from ispconfig.org.
Reply With Quote
  #3  
Old 22nd February 2007, 09:14
yogi183 yogi183 is offline
Junior Member
 
Join Date: Feb 2007
Posts: 4
Thanks: 0
Thanked 1 Time in 1 Post
Default

I had a look around and saw a similar error on 64bit systems, but no this is 32bit, that is why im so confused as to why im getting this error, is there anything that guide doesn't include that i should do?
Reply With Quote
  #4  
Old 22nd February 2007, 11:54
denmaus denmaus is offline
Member
 
Join Date: May 2006
Posts: 42
Thanks: 0
Thanked 0 Times in 0 Posts
Default

in the top of the log you have: "compiler error" messages

have you gcc installed?

may be reinstall will help
Reply With Quote
  #5  
Old 23rd February 2007, 01:51
yogi183 yogi183 is offline
Junior Member
 
Join Date: Feb 2007
Posts: 4
Thanks: 0
Thanked 1 Time in 1 Post
Default

Ok, i'll reply again and i will go through the setup guide again, and yes i did have gcc installed. and i copied from where the errors started, so no compile errors.

I'll post the whole log next time.

Thanks for your reply
Reply With Quote
The Following User Says Thank You to yogi183 For This Useful Post:
AbannyvabVask (4th December 2013)
  #6  
Old 23rd February 2007, 03:20
yogi183 yogi183 is offline
Junior Member
 
Join Date: Feb 2007
Posts: 4
Thanks: 0
Thanked 1 Time in 1 Post
Default

latest run gave me this

Quote:
make[1]: Leaving directory `/install_ispconfig/compile_aps/openssl-0.9.8d/crypto'
making all in ssl...
make[1]: Entering directory `/install_ispconfig/compile_aps/openssl-0.9.8d/ssl'
it does a whole lot of stuff successfully and then

Quote:
t1_enc.c: In function `tls1_change_cipher_state':
t1_enc.c:442: error: insn does not satisfy its constraints:
(insn:TI 840 839 841 0x40240b00 (set (reg 6 ebp [281])
(mem:SI (plus:SI (reg:SI 3 ebx [278])
(const_int 192 [0xc0])) [0 S4 A32])) 38 {*movsi_1} (insn_list 835 (insn_list 1457 (insn_list 1455 (insn_list 837 (insn_list 839 (nil))))))
(expr_list:REG_EQUIV (mem:SI (plus:SI (reg/f:SI 0 eax [278])
(const_int 192 [0xc0])) [0 S4 A32])
(nil)))
t1_enc.c:442: internal compiler error: in final_scan_insn, at final.c:2722
Please submit a full bug report,
with preprocessed source if appropriate.
See <URL:http://gcc.gnu.org/bugs.html> for instructions.
For Debian GNU/Linux specific bug reporting instructions, see
<URL:file:///usr/share/doc/gcc-3.3/README.Bugs>.
make[1]: *** [t1_enc.o] Error 1
make[1]: Leaving directory `/install_ispconfig/compile_aps/openssl-0.9.8d/ssl'
make: *** [build_ssl] Error 1
ERROR: Could not make OpenSSL
cd: could not get current directory: getcwd: cannot access parent directories: No such file or directory
cd: could not get current directory: getcwd: cannot access parent directories: No such file or directory
job-working-directory: could not get current directory: getcwd: cannot access parent directories: No such file or directory
mv: cannot stat `binaries/aps.tar.gz': No such file or directory
mv: cannot stat `binaries/spamassassin.tar.gz': No such file or directory
job-working-directory: could not get current directory: getcwd: cannot access parent directories: No such file or directory
mv: cannot stat `binaries/uudeview.tar.gz': No such file or directory
job-working-directory: could not get current directory: getcwd: cannot access parent directories: No such file or directory
mv: cannot stat `binaries/clamav.tar.gz': No such file or directory
job-working-directory: could not get current directory: getcwd: cannot access parent directories: No such file or directory
mv: cannot stat `binaries/cronolog': No such file or directory
job-working-directory: could not get current directory: getcwd: cannot access parent directories: No such file or directory
mv: cannot stat `binaries/cronosplit': No such file or directory
job-working-directory: could not get current directory: getcwd: cannot access parent directories: No such file or directory
mv: cannot stat `binaries/ispconfig_tcpserver': No such file or directory
job-working-directory: could not get current directory: getcwd: cannot access parent directories: No such file or directory
mv: cannot stat `binaries/zip': No such file or directory
job-working-directory: could not get current directory: getcwd: cannot access parent directories: No such file or directory
mv: cannot stat `binaries/unzip': No such file or directory
job-working-directory: could not get current directory: getcwd: cannot access parent directories: No such file or directory
tar: spamassassin.tar.gz: Cannot open: No such file or directory
tar: Error is not recoverable: exiting now
tar: Child returned status 2
tar: Error exit delayed from previous errors
job-working-directory: could not get current directory: getcwd: cannot access parent directories: No such file or directory
mv: cannot stat `spamassassin': No such file or directory
job-working-directory: could not get current directory: getcwd: cannot access parent directories: No such file or directory
tar: uudeview.tar.gz: Cannot openjob-working-directory: could not get current directory: getcwd: cannot access parent directories: No such file or directory
: No such file or directory
tar: Error is not recoverable: exiting now
tar: Child returned status 2
tar: Error exit delayed from previous errors
mv: cannot stat `uudeview'job-working-directory: could not get current directory: getcwd: cannot access parent directories: No such file or directory
: No such file or directory
tar: clamav.tar.gz: Cannot openjob-working-directory: could not get current directory: getcwd: cannot access parent directories: No such file or directory
: No such file or directory
tar: Error is not recoverable: exiting now
tar: Child returned status 2
tar: Error exit delayed from previous errors
job-working-directory: could not get current directory: getcwd: cannot access parent directories: No such file or directory
mv: cannot stat `clamav': No such file or directory
job-working-directory: could not get current directory: getcwd: cannot access parent directories: No such file or directory
tar: aps.tar.gz: Cannot open: No such file or directory
tar: Error is not recoverable: exiting now
tar: Child returned status 2
tar: Error exit delayed from previous errors
./setup2: line 860: ispconfig_tmp/php/bin/php: No such file or directory
job-working-directory: could not get current directory: getcwd: cannot access parent directories: No such file or directory
ERROR: The PHP binary coming with ISPConfig does not work properly on your system! The installation routine stops here!
job-working-directory: could not get current directory: getcwd: cannot access parent directories: No such file or directory
Reply With Quote
  #7  
Old 23rd February 2007, 16:11
falko falko is offline
Super Moderator
 
Join Date: Apr 2005
Location: Lüneburg, Germany
Posts: 41,701
Thanks: 1,900
Thanked 2,741 Times in 2,575 Posts
 
Default

Something seems to be wrong with your gcc package. Maybe you can replace it with a newer version (I think gcc 3.4 and maybe 4.0 should be available for Sarge).
__________________
Falko
--
Download the ISPConfig 3 Manual! | Check out the ISPConfig 3 Billing Module!

FB: http://www.facebook.com/howtoforge

nginx-Webhosting: Timme Hosting | Follow me on:
Reply With Quote
Reply

Bookmarks

Thread Tools
Display Modes

Posting Rules
You may not post new threads
You may not post replies
You may not post attachments
You may not edit your posts

BB code is On
Smilies are On
[IMG] code is On
HTML code is Off

Forum Jump

Similar Threads
Thread Thread Starter Forum Replies Last Post
ISPConfig Installation complete but Cannot access page with IP (Debian 3.1) alexan HOWTO-Related Questions 10 24th December 2006 13:33
newbie ububtu 6.0.6 error PHP binary line 816 davidsky73 Installation/Configuration 8 17th September 2006 11:51
Debian 3.1 Installation Additional Required Tasks martinoc Installation/Configuration 0 30th May 2006 01:44
ISPC install stops str2etboy Installation/Configuration 19 28th January 2006 07:18
perfect Debian installation 3.1 Ryanayr HOWTO-Related Questions 1 28th August 2005 10:33


All times are GMT +2. The time now is 18:42.


Powered by vBulletin® Version 3.8.7
Copyright ©2000 - 2014, vBulletin Solutions, Inc.