Go Back   HowtoForge Forums | HowtoForge - Linux Howtos and Tutorials > ISPConfig 2 > Installation/Configuration

Do you like HowtoForge? Please consider supporting us by becoming a subscriber.
Reply
 
Thread Tools Display Modes
  #1  
Old 4th November 2007, 07:47
KalishNikova KalishNikova is offline
Junior Member
 
Join Date: Nov 2007
Posts: 3
Thanks: 0
Thanked 0 Times in 0 Posts
Default The PHP binary coming with ISPConfig does not work properly on your system!

Ok, after much searching with google, reading through the forum here, and using the search option and I can't find anyone thats had this problem (though I may be blind, i've been at this for about 6 hours now)

Heres the error I'm recieving:

ERROR: Could not make OpenSSL
cd: could not get current directory: getcwd: cannot access parent directories: No such file or directory
cd: could not get current directory: getcwd: cannot access parent directories: No such file or directory
job-working-directory: could not get current directory: getcwd: cannot access parent directories: No such file or directory
mv: cannot stat `binaries/aps.tar.gz': No such file or directory
mv: cannot stat `binaries/spamassassin.tar.gz'job-working-directory: could not get current directory: getcwd: cannot access parent directories: No such file or directory
: No such file or directory
mv: cannot stat `binaries/uudeview.tar.gz': No such file or directory
job-working-directory: could not get current directory: getcwd: cannot access parent directories: No such file or directory
mv: cannot stat `binaries/clamav.tar.gz'job-working-directory: could not get current directory: getcwd: cannot access parent directories: No such file or directory
: No such file or directory
mv: cannot stat `binaries/cronolog'job-working-directory: could not get current directory: getcwd: cannot access parent directories: No such file or directory
: No such file or directory
job-working-directory: could not get current directory: getcwd: cannot access parent directories: No such file or directory
mv: cannot stat `binaries/cronosplit': No such file or directory
job-working-directory: could not get current directory: getcwd: cannot access parent directories: No such file or directory
mv: cannot stat `binaries/ispconfig_tcpserver': No such file or directory
mv: cannot stat `binaries/zip': No such file or directory
job-working-directory: could not get current directory: getcwd: cannot access parent directories: No such file or directory
mv: cannot stat `binaries/unzip': No such file or directory
job-working-directory: could not get current directory: getcwd: cannot access parent directories: No such file or directory
job-working-directory: could not get current directory: getcwd: cannot access parent directories: No such file or directory
tar: spamassassin.tar.gz: Cannot open: No such file or directory
tar: Error is not recoverable: exiting now
tar: Child returned status 2
tar: Error exit delayed from previous errors
mv: cannot stat `spamassassin'job-working-directory: could not get current directory: getcwd: cannot access parent directories: No such file or directory
: No such file or directory
job-working-directory: could not get current directory: getcwd: cannot access parent directories: No such file or directory
tar: uudeview.tar.gz: Cannot open: No such file or directory
tar: Error is not recoverable: exiting now
tar: Child returned status 2
tar: Error exit delayed from previous errors
job-working-directory: could not get current directory: getcwd: cannot access parent directories: No such file or directory
mv: cannot stat `uudeview': No such file or directory
job-working-directory: could not get current directory: getcwd: cannot access parent directories: No such file or directory
tar: clamav.tar.gz: Cannot open: No such file or directory
tar: Error is not recoverable: exiting now
tar: Child returned status 2
tar: Error exit delayed from previous errors
mv: cannot stat `clamav': No such file or directory
job-working-directory: could not get current directory: getcwd: cannot access parent directories: No such file or directory
tar: aps.tar.gz: Cannot openjob-working-directory: could not get current directory: getcwd: cannot access parent directories: No such file or directory
: No such file or directory
tar: Error is not recoverable: exiting now
tar: Child returned status 2
tar: Error exit delayed from previous errors
./setup2: line 873: ispconfig_tmp/php/bin/php: No such file or directory
job-working-directory: could not get current directory: getcwd: cannot access parent directories: No such file or directory
ERROR: The PHP binary coming with ISPConfig does not work properly on your system! The installation routine stops here!
job-working-directory: could not get current directory: getcwd: cannot access parent directories: No such file or directory
Reply With Quote
Sponsored Links
  #2  
Old 4th November 2007, 11:07
till till is offline
Super Moderator
 
Join Date: Apr 2005
Location: Lüneburg, Germany
Posts: 37,037
Thanks: 841
Thanked 5,657 Times in 4,465 Posts
Default

Which error was displayed before the line "ERROR: Could not make OpenSSL"? All other errors that you posted above are caused by the error that appeared before the line.

Also, which linux distribution do you use and is this a 32Bit or 64Bit distribution and kernel?
__________________
Till Brehm
--
Get ISPConfig support and the ISPConfig 3 manual from ispconfig.org.
Reply With Quote
  #3  
Old 4th November 2007, 18:51
KalishNikova KalishNikova is offline
Junior Member
 
Join Date: Nov 2007
Posts: 3
Thanks: 0
Thanked 0 Times in 0 Posts
Default

Debian 3.1, 32bit

ofb64ede.c: In function `DES_ede3_ofb64_encrypt':
ofb64ede.c:111: internal compiler error: Segmentation fault
Please submit a full bug report,
with preprocessed source if appropriate.
See <URL:http://gcc.gnu.org/bugs.html> for instructions.
For Debian GNU/Linux specific bug reporting instructions, see
<URL:file:///usr/share/doc/gcc-3.3/README.Bugs>.
make[2]: *** [ofb64ede.o] Error 1
make[2]: Leaving directory `/home/mjfletcher/install_ispconfig/compile_aps/openssl-0.9.7m/crypto/des'
make[1]: *** [subdirs] Error 1
make[1]: Leaving directory `/home/mjfletcher/install_ispconfig/compile_aps/openssl-0.9.7m/crypto'
make: *** [sub_all] Error 1
ERROR: Could not make OpenSSL
Reply With Quote
  #4  
Old 5th November 2007, 10:37
till till is offline
Super Moderator
 
Join Date: Apr 2005
Location: Lüneburg, Germany
Posts: 37,037
Thanks: 841
Thanked 5,657 Times in 4,465 Posts
Default

Segmentation faults during compilation are caused by hardware problems in most cases. Please run e.g. the memcheck program to test your server. You can find memcheck as start option on the boot CD of most linux distributions.
__________________
Till Brehm
--
Get ISPConfig support and the ISPConfig 3 manual from ispconfig.org.
Reply With Quote
  #5  
Old 6th November 2007, 01:16
KalishNikova KalishNikova is offline
Junior Member
 
Join Date: Nov 2007
Posts: 3
Thanks: 0
Thanked 0 Times in 0 Posts
Default

Memcheck run, no errors found. Any idea what else might be causing it?
Reply With Quote
  #6  
Old 6th November 2007, 15:42
ggarcia24 ggarcia24 is offline
Junior Member
 
Join Date: Nov 2007
Posts: 20
Thanks: 1
Thanked 0 Times in 0 Posts
Default

Hi, i'm new to this system and i'm trying to installit in a Debian 4.0

I've followed the howtoforge manual: "The Perfect Setup - Debian Etch (Debian 4.0)" on a Debian etch netinst r1 getting the same problem...

But if i see the logs (/var/log/ispconfig_install.log) ther is a warning first that says and quote:

[QUOTE]
WARNING: could not unpack ISPConfig system
[QUOTE]

I'm guessing that you are having the same problem

Hope you can help us/me

PS: By the way.... is there any palce were i can se a demo running????
Reply With Quote
Reply

Bookmarks

Thread Tools
Display Modes

Posting Rules
You may not post new threads
You may not post replies
You may not post attachments
You may not edit your posts

BB code is On
Smilies are On
[IMG] code is On
HTML code is Off

Forum Jump

Similar Threads
Thread Thread Starter Forum Replies Last Post
ERROR: The PHP binary coming with ISPConfig does not work properly on your system! Th Nilton Godoi Bueno Installation/Configuration 1 26th May 2007 16:31
ERROR: The PHP binary coming with ISPConfig does not work properly on your system W1SKCC Installation/Configuration 2 2nd February 2007 14:55
Another ERROR: The PHP binary coming with ISPConfig does not work properly on your sy hoopsx3 Installation/Configuration 2 29th January 2007 08:56
"s3_pkt.c:795" leads to "ERROR: The PHP binary coming with ISPConfig does not work" xavier Installation/Configuration 3 9th October 2006 23:50
php script injections Grizzly General 21 18th July 2006 09:55


All times are GMT +2. The time now is 19:58.


Powered by vBulletin® Version 3.8.7
Copyright ©2000 - 2014, vBulletin Solutions, Inc.