Thread: update failed
View Single Post
  #1  
Old 24th November 2007, 10:28
loge loge is offline
Junior Member
 
Join Date: Nov 2007
Posts: 21
Thanks: 1
Thanked 1 Time in 1 Post
Default update failed

Hi,

i hoped that i can upgrade my (fresh installed) VMware based ISPConfig to latest version without troubles, but i got this:

/usr/lib/libc_nonshared.a(atexit.oS)(.gnu.linkonce.t.__i686 .get_pc_thunk.bx+0x0): In function `__i686.get_pc_thunk.bx':
: multiple definition of `__i686.get_pc_thunk.bx'
/usr/lib/gcc-lib/i486-linux/3.3.5/crtbeginS.o(.gnu.linkonce.t.__i686.get_pc_thunk.bx +0x0): first defined here
collect2: ld returned 1 exit status
make[2]: *** [libclamav.la] Error 1
make[2]: Leaving directory `/home/admin/install_ispconfig/compile_aps/clamav-0.91.2/libclamav'
make[1]: *** [all-recursive] Error 1
make[1]: Leaving directory `/home/admin/install_ispconfig/compile_aps/clamav-0.91.2'
make: *** [all] Error 2
ERROR: Could not make ClamAV
cd: could not get current directory: getcwd: cannot access parent directories: No such file or directory
cd: could not get current directory: getcwd: cannot access parent directories: No such file or directory
mv: cannot stat `binaries/aps.tar.gz': No such file or directory
job-working-directory: could not get current directory: getcwd: cannot access parent directories: No such file or directory
mv: cannot stat `binaries/spamassassin.tar.gz': No such file or directory
job-working-directory: could not get current directory: getcwd: cannot access parent directories: No such file or directory
mv: cannot stat `binaries/uudeview.tar.gz': No such file or directory
job-working-directory: could not get current directory: getcwd: cannot access parent directories: No such file or directory
mv: cannot stat `binaries/clamav.tar.gz': No such file or directory
job-working-directory: could not get current directory: getcwd: cannot access parent directories: No such file or directory
mv: cannot stat `binaries/cronolog': No such file or directory
job-working-directory: could not get current directory: getcwd: cannot access parent directories: No such file or directory
mv: cannot stat `binaries/cronosplit': No such file or directory
job-working-directory: could not get current directory: getcwd: cannot access parent directories: No such file or directory
job-working-directory: could not get current directory: getcwd: cannot access parent directories: No such file or directory
mv: cannot stat `binaries/ispconfig_tcpserver': No such file or directory
job-working-directory: could not get current directory: getcwd: cannot access parent directories: No such file or directory
mv: cannot stat `binaries/zip': No such file or directory
mv: cannot stat `binaries/unzip': No such file or directory
job-working-directory: could not get current directory: getcwd: cannot access parent directories: No such file or directory
tar: spamassassin.tar.gz: Cannot open: No such file or directory
tar: Error is not recoverable: exiting now
tar: Child returned status 2
tar: Error exit delayed from previous errors
job-working-directory: could not get current directory: getcwd: cannot access parent directories: No such file or directory
mv: cannot stat `spamassassin': No such file or directory
job-working-directory: could not get current directory: getcwd: cannot access parent directories: No such file or directory
tar: uudeview.tar.gz: Cannot open: No such file or directory
tar: Error is not recoverable: exiting now
tar: Child returned status 2
tar: Error exit delayed from previous errors
job-working-directory: could not get current directory: getcwd: cannot access parent directories: No such file or directory
mv: cannot stat `uudeview': No such file or directory
job-working-directory: could not get current directory: getcwd: cannot access parent directories: No such file or directory
tar: clamav.tar.gz: Cannot open: No such file or directory
tar: Error is not recoverable: exiting now
tar: Child returned status 2
tar: Error exit delayed from previous errors
job-working-directory: could not get current directory: getcwd: cannot access parent directories: No such file or directory
mv: cannot stat `clamav': No such file or directory
job-working-directory: could not get current directory: getcwd: cannot access parent directories: No such file or directory
tar: aps.tar.gz: Cannot open: No such file or directory
tar: Error is not recoverable: exiting now
tar: Child returned status 2
tar: Error exit delayed from previous errors
job-working-directory: could not get current directory: getcwd: cannot access parent directories: No such file or directory
./setup2: line 873: ispconfig_tmp/php/bin/php: No such file or directory
job-working-directory: could not get current directory: getcwd: cannot access parent directories: No such file or directory
job-working-directory: could not get current directory: getcwd: cannot access parent directories: No such file or directory
ERROR: Das mitgelieferte PHP-Binary funktioniert auf Ihrem System nicht! Die Installation bricht hier ab!
job-working-directory: could not get current directory: getcwd: cannot access parent directories: No such file or directory


Can anyone say whats wrong there?

Marc
Reply With Quote
Sponsored Links