View Single Post
  #3  
Old 4th November 2007, 18:51
KalishNikova KalishNikova is offline
Junior Member
 
Join Date: Nov 2007
Posts: 3
Thanks: 0
Thanked 0 Times in 0 Posts
Default

Debian 3.1, 32bit

ofb64ede.c: In function `DES_ede3_ofb64_encrypt':
ofb64ede.c:111: internal compiler error: Segmentation fault
Please submit a full bug report,
with preprocessed source if appropriate.
See <URL:http://gcc.gnu.org/bugs.html> for instructions.
For Debian GNU/Linux specific bug reporting instructions, see
<URL:file:///usr/share/doc/gcc-3.3/README.Bugs>.
make[2]: *** [ofb64ede.o] Error 1
make[2]: Leaving directory `/home/mjfletcher/install_ispconfig/compile_aps/openssl-0.9.7m/crypto/des'
make[1]: *** [subdirs] Error 1
make[1]: Leaving directory `/home/mjfletcher/install_ispconfig/compile_aps/openssl-0.9.7m/crypto'
make: *** [sub_all] Error 1
ERROR: Could not make OpenSSL
Reply With Quote