View Single Post
  #10  
Old 28th August 2007, 01:25
CaptainBalou CaptainBalou is offline
Junior Member
 
Join Date: Aug 2007
Posts: 29
Thanks: 8
Thanked 1 Time in 1 Post
Default

Hello again,

I think I have every package I need.

Code:
openssl-32bit-0.9.8a-16
openssl-devel-32bit-0.9.8a-16
php5-openssl-5.1.2-27
openssl-devel-0.9.8a-16
openssl-0.9.8a-16
I re-did the hole "perfect installation"-guide for my SuSE 10.1. Still the following output:

Code:
gcc -I. -I.. -I../include -DOPENSSL_THREADS -D_REENTRANT -DDSO_DLFCN -DHAVE_DLFCN_H -DL_ENDIAN -DTERMIO -O3 -fomit-frame-pointer -Wall -DOPENSSL_BN_ASM_PART_WORDS -DOPENSSL_IA32_SSE2 -DSHA1_ASM -DMD5_ASM -DRMD160_ASM -DAES_ASM   -c -o o_dir.o o_dir.c
/usr/bin/perl x86cpuid.pl elf -I. -I.. -I../include -DOPENSSL_THREADS -D_REENTRANT -DDSO_DLFCN -DHAVE_DLFCN_H -DL_ENDIAN -DTERMIO -O3 -fomit-frame-pointer -Wall -DOPENSSL_BN_ASM_PART_WORDS -DOPENSSL_IA32_SSE2 -DSHA1_ASM -DMD5_ASM -DRMD160_ASM -DAES_ASM  > x86cpuid-elf.s
gcc -I. -I.. -I../include -DOPENSSL_THREADS -D_REENTRANT -DDSO_DLFCN -DHAVE_DLFCN_H -DL_ENDIAN -DTERMIO -O3 -fomit-frame-pointer -Wall -DOPENSSL_BN_ASM_PART_WORDS -DOPENSSL_IA32_SSE2 -DSHA1_ASM -DMD5_ASM -DRMD160_ASM -DAES_ASM -c  -o x86cpuid-elf.o x86cpuid-elf.s
x86cpuid-elf.s: Assembler messages:
x86cpuid-elf.s:13: Error: suffix or operands invalid for `push'
x86cpuid-elf.s:14: Error: suffix or operands invalid for `push'
x86cpuid-elf.s:15: Error: suffix or operands invalid for `push'
x86cpuid-elf.s:16: Error: suffix or operands invalid for `push'
x86cpuid-elf.s:19: Error: suffix or operands invalid for `pushf'
x86cpuid-elf.s:20: Error: suffix or operands invalid for `pop'
x86cpuid-elf.s:23: Error: suffix or operands invalid for `push'
x86cpuid-elf.s:24: Error: suffix or operands invalid for `popf'
x86cpuid-elf.s:25: Error: suffix or operands invalid for `pushf'
x86cpuid-elf.s:26: Error: suffix or operands invalid for `pop'
x86cpuid-elf.s:35: Error: suffix or operands invalid for `pop'
x86cpuid-elf.s:36: Error: suffix or operands invalid for `pop'
x86cpuid-elf.s:37: Error: suffix or operands invalid for `pop'
x86cpuid-elf.s:38: Error: suffix or operands invalid for `pop'
x86cpuid-elf.s:70: Error: suffix or operands invalid for `pushf'
x86cpuid-elf.s:71: Error: suffix or operands invalid for `pop'
x86cpuid-elf.s:75: Error: suffix or operands invalid for `push'
x86cpuid-elf.s:76: Error: suffix or operands invalid for `push'
x86cpuid-elf.s:95: Error: suffix or operands invalid for `pushf'
x86cpuid-elf.s:96: Error: suffix or operands invalid for `pop'
x86cpuid-elf.s:155: Error: suffix or operands invalid for `push'
x86cpuid-elf.s:164: Error: suffix or operands invalid for `pop'
x86cpuid-elf.s:174: Error: suffix or operands invalid for `push'
x86cpuid-elf.s:193: Error: suffix or operands invalid for `pop'
x86cpuid-elf.s:212: Error: suffix or operands invalid for `pop'
x86cpuid-elf.s:215: Error: suffix or operands invalid for `push'
x86cpuid-elf.s:218: Error: suffix or operands invalid for `pop'
x86cpuid-elf.s:222: Error: suffix or operands invalid for `push'
x86cpuid-elf.s:223: Error: suffix or operands invalid for `push'
x86cpuid-elf.s:229: Error: suffix or operands invalid for `pop'
x86cpuid-elf.s:230: Error: suffix or operands invalid for `pop'
make[1]: *** [x86cpuid-elf.o] Error 1
make[1]: Leaving directory `/tmp/install/ISPConfig/install_ispconfig/compile_aps/openssl-0.9.8e/crypto'
make: *** [build_crypto] Error 1
ERROR: Could not make OpenSSL
cd: error retrieving current directory: getcwd: cannot access parent directories: No such file or directory
mv: cannot stat `binaries/aps.tar.gz': No such file or directory
mv: cannot stat `binaries/spamassassin.tar.gz': No such file or directory
mv: cannot stat `binaries/uudeview.tar.gz': No such file or directory
mv: cannot stat `binaries/clamav.tar.gz': No such file or directory
mv: cannot stat `binaries/cronolog': No such file or directory
mv: cannot stat `binaries/cronosplit': No such file or directory
mv: cannot stat `binaries/ispconfig_tcpserver': No such file or directory
mv: cannot stat `binaries/zip': No such file or directory
mv: cannot stat `binaries/unzip': No such file or directory
tar: spamassassin.tar.gz: Cannot open: No such file or directory
tar: Error is not recoverable: exiting now
tar: Child returned status 2
tar: Error exit delayed from previous errors
mv: cannot stat `spamassassin': No such file or directory
tar: uudeview.tar.gz: Cannot open: No such file or directory
tar: Error is not recoverable: exiting now
tar: Child returned status 2
tar: Error exit delayed from previous errors
mv: cannot stat `uudeview': No such file or directory
tar: clamav.tar.gz: Cannot open: No such file or directory
tar: Error is not recoverable: exiting now
tar: Child returned status 2
tar: Error exit delayed from previous errors
mv: cannot stat `clamav': No such file or directory
tar: aps.tar.gz: Cannot open: No such file or directory
tar: Error is not recoverable: exiting now
tar: Child returned status 2
tar: Error exit delayed from previous errors
./setup2: line 873: ispconfig_tmp/php/bin/php: No such file or directory
ERROR: Das mitgelieferte PHP-Binary funktioniert auf Ihrem System nicht! Die Installation bricht hier ab!
Any other ideas? ;-)

--
Regards
Marco
Reply With Quote