View Single Post
  #8  
Old 25th August 2007, 00:10
CaptainBalou CaptainBalou is offline
Junior Member
 
Join Date: Aug 2007
Posts: 29
Thanks: 8
Thanked 1 Time in 1 Post
Thumbs down

Hi folks,

no, I've no tipps - just a comment: Same OS, same Version and also no successful installation. :-(

Regards
Marco


Code:
.
.
.
make[2]: Entering directory `/tmp/install/ISPConfig/install_ispconfig/compile_aps/openssl-0.9.8e/crypto/pqueue'
pqueue.h => ../../include/openssl/pqueue.h
pq_compat.h => ../../include/openssl/pq_compat.h
make[2]: Leaving directory `/tmp/install/ISPConfig/install_ispconfig/compile_aps/openssl-0.9.8e/crypto/pqueue'
make[1]: Leaving directory `/tmp/install/ISPConfig/install_ispconfig/compile_aps/openssl-0.9.8e/crypto'
making links in ssl...
make[1]: Entering directory `/tmp/install/ISPConfig/install_ispconfig/compile_aps/openssl-0.9.8e/ssl'
ssl.h => ../include/openssl/ssl.h
ssl2.h => ../include/openssl/ssl2.h
ssl3.h => ../include/openssl/ssl3.h
ssl23.h => ../include/openssl/ssl23.h
tls1.h => ../include/openssl/tls1.h
dtls1.h => ../include/openssl/dtls1.h
kssl.h => ../include/openssl/kssl.h
ssltest.c => ../test/ssltest.c
make[1]: Leaving directory `/tmp/install/ISPConfig/install_ispconfig/compile_aps/openssl-0.9.8e/ssl'
making links in engines...
make[1]: Entering directory `/tmp/install/ISPConfig/install_ispconfig/compile_aps/openssl-0.9.8e/engines'
make[1]: Nothing to be done for `links'.
make[1]: Leaving directory `/tmp/install/ISPConfig/install_ispconfig/compile_aps/openssl-0.9.8e/engines'
making links in apps...
make[1]: Entering directory `/tmp/install/ISPConfig/install_ispconfig/compile_aps/openssl-0.9.8e/apps'
make[1]: Nothing to be done for `links'.
make[1]: Leaving directory `/tmp/install/ISPConfig/install_ispconfig/compile_aps/openssl-0.9.8e/apps'
making links in test...
make[1]: Entering directory `/tmp/install/ISPConfig/install_ispconfig/compile_aps/openssl-0.9.8e/test'
make[1]: Nothing to be done for `links'.
make[1]: Leaving directory `/tmp/install/ISPConfig/install_ispconfig/compile_aps/openssl-0.9.8e/test'
making links in tools...
make[1]: Entering directory `/tmp/install/ISPConfig/install_ispconfig/compile_aps/openssl-0.9.8e/tools'
make[1]: Nothing to be done for `links'.
make[1]: Leaving directory `/tmp/install/ISPConfig/install_ispconfig/compile_aps/openssl-0.9.8e/tools'
generating dummy tests (if needed)...
make[1]: Entering directory `/tmp/install/ISPConfig/install_ispconfig/compile_aps/openssl-0.9.8e/test'
make[1]: Nothing to be done for `generate'.
make[1]: Leaving directory `/tmp/install/ISPConfig/install_ispconfig/compile_aps/openssl-0.9.8e/test'

Configured for linux-elf.
making all in crypto...
make[1]: Entering directory `/tmp/install/ISPConfig/install_ispconfig/compile_aps/openssl-0.9.8e/crypto'
( echo "#ifndef MK1MF_BUILD"; \
echo '  /* auto-generated by crypto/Makefile for crypto/cversion.c */'; \
echo '  #define CFLAGS "gcc -DOPENSSL_THREADS -D_REENTRANT -DDSO_DLFCN -DHAVE_DLFCN_H -DL_ENDIAN -DTERMIO -O3 -fomit-frame-pointer -Wall -DOPENSSL_BN_ASM_PART_WORDS -DOPENSSL_IA32_SSE2 -DSHA1_ASM -DMD5_ASM -DRMD160_ASM -DAES_ASM"'; \
echo '  #define PLATFORM "linux-elf"'; \
echo "  #define DATE \"`LC_ALL=C LC_TIME=C date`\""; \
echo '#endif' ) >buildinf.h
gcc -I. -I.. -I../include -DOPENSSL_THREADS -D_REENTRANT -DDSO_DLFCN -DHAVE_DLFCN_H -DL_ENDIAN -DTERMIO -O3 -fomit-frame-pointer -Wall -DOPENSSL_BN_ASM_PART_WORDS -DOPENSSL_IA32_SSE2 -DSHA1_ASM -DMD5_ASM -DRMD160_ASM -DAES_ASM   -c -o cryptlib.o cryptlib.c
In file included from /usr/include/features.h:346,
                 from /usr/include/stdlib.h:25,
                 from cryptlib.h:62,
                 from cryptlib.c:117:
/usr/include/gnu/stubs.h:7:27: error: gnu/stubs-32.h: No such file or directory
cryptlib.c: In function 'CRYPTO_get_new_dynlockid':
cryptlib.c:280: warning: value computed is not used
cryptlib.c: In function 'CRYPTO_destroy_dynlockid':
cryptlib.c:322: warning: value computed is not used
make[1]: *** [cryptlib.o] Error 1
make[1]: Leaving directory `/tmp/install/ISPConfig/install_ispconfig/compile_aps/openssl-0.9.8e/crypto'
make: *** [build_crypto] Error 1
ERROR: Could not make OpenSSL
cd: error retrieving current directory: getcwd: cannot access parent directories: No such file or directory
mv: cannot stat `binaries/aps.tar.gz': No such file or directory
mv: cannot stat `binaries/spamassassin.tar.gz': No such file or directory
mv: cannot stat `binaries/uudeview.tar.gz': No such file or directory
mv: cannot stat `binaries/clamav.tar.gz': No such file or directory
mv: cannot stat `binaries/cronolog': No such file or directory
mv: cannot stat `binaries/cronosplit': No such file or directory
mv: cannot stat `binaries/ispconfig_tcpserver': No such file or directory
mv: cannot stat `binaries/zip': No such file or directory
mv: cannot stat `binaries/unzip': No such file or directory
tar: spamassassin.tar.gz: Cannot open: No such file or directory
tar: Error is not recoverable: exiting now
tar: Child returned status 2
tar: Error exit delayed from previous errors
mv: cannot stat `spamassassin': No such file or directory
tar: uudeview.tar.gz: Cannot open: No such file or directory
tar: Error is not recoverable: exiting now
tar: Child returned status 2
tar: Error exit delayed from previous errors
mv: cannot stat `uudeview': No such file or directory
tar: clamav.tar.gz: Cannot open: No such file or directory
tar: Error is not recoverable: exiting now
tar: Child returned status 2
tar: Error exit delayed from previous errors
mv: cannot stat `clamav': No such file or directory
tar: aps.tar.gz: Cannot open: No such file or directory
tar: Error is not recoverable: exiting now
tar: Child returned status 2
tar: Error exit delayed from previous errors
./setup2: line 873: ispconfig_tmp/php/bin/php: No such file or directory
ERROR: Das mitgelieferte PHP-Binary funktioniert auf Ihrem System nicht! Die Installation bricht hier ab!
server:/tmp/install/ISPConfig/install_ispconfig #
Reply With Quote