View Single Post
  #7  
Old 15th March 2007, 20:04
Spudchat Spudchat is offline
Member
 
Join Date: Aug 2006
Posts: 32
Thanks: 1
Thanked 1 Time in 1 Post
Default

Hmm, when I tried, it took an unusually long amount of time, and I received a few error messages I never had before. Here are the errors:

Code:
/usr/bin/install -c .libs/libclamav.so.2.0.1 /home/admispconfig/ispconfig/tools/clamav/lib/libclamav.so.2.0.1
/usr/bin/install: cannot remove `/home/admispconfig/ispconfig/tools/clamav/lib/libclamav.so.2.0.1': Read-only file system
make[2]: *** [install-libLTLIBRARIES] Error 1
make[2]: Leaving directory `/root/install_ispconfig/compile_aps/clamav-0.90.1/libclamav'
make[1]: *** [install-am] Error 2
make[1]: Leaving directory `/root/install_ispconfig/compile_aps/clamav-0.90.1/libclamav'
make: *** [install-recursive] Error 1
ERROR: Could not install ClamAV
cd: could not get current directory: getcwd: cannot access parent directories: No such file or directory
cd: could not get current directory: getcwd: cannot access parent directories: No such file or directory
mv: cannot stat `binaries/aps.tar.gz': No such file or directory
job-working-directory: could not get current directory: getcwd: cannot access parent directories: No such file or directory
mv: cannot stat `binaries/spamassassin.tar.gz': No such file or directory
job-working-directory: could not get current directory: getcwd: cannot access parent directories: No such file or directory
mv: cannot stat `binaries/uudeview.tar.gz'job-working-directory: could not get current directory: getcwd: cannot access parent directories: No such file or directory
: No such file or directory
job-working-directory: could not get current directory: getcwd: cannot access parent directories: No such file or directory
mv: cannot stat `binaries/clamav.tar.gz': No such file or directory
job-working-directory: could not get current directory: getcwd: cannot access parent directories: No such file or directory
mv: cannot stat `binaries/cronolog': No such file or directory
mv: cannot stat `binaries/cronosplit': No such file or directory
job-working-directory: could not get current directory: getcwd: cannot access parent directories: No such file or directory
mv: cannot stat `binaries/ispconfig_tcpserver': No such file or directory
job-working-directory: could not get current directory: getcwd: cannot access parent directories: No such file or directory
mv: cannot stat `binaries/zip': No such file or directory
job-working-directory: could not get current directory: getcwd: cannot access parent directories: No such file or directory
mv: cannot stat `binaries/unzip': No such file or directory
job-working-directory: could not get current directory: getcwd: cannot access parent directories: No such file or directory
tar: spamassassin.tar.gz: Cannot open: No such file or directory
tar: Error is not recoverable: exiting now
tar: Child returned status 2
tar: Error exit delayed from previous errors
job-working-directory: could not get current directory: getcwd: cannot access parent directories: No such file or directory
mv: cannot stat `spamassassin': No such file or directory
job-working-directory: could not get current directory: getcwd: cannot access parent directories: No such file or directory
tar: uudeview.tar.gz: Cannot open: No such file or directory
tar: Error is not recoverable: exiting now
tar: Child returned status 2
tar: Error exit delayed from previous errors
job-working-directory: could not get current directory: getcwd: cannot access parent directories: No such file or directory
mv: cannot stat `uudeview': No such file or directory
job-working-directory: could not get current directory: getcwd: cannot access parent directories: No such file or directory
tar: clamav.tar.gz: Cannot openjob-working-directory: could not get current directory: getcwd: cannot access parent directories: No such file or directory
: No such file or directory
tar: Error is not recoverable: exiting now
tar: Child returned status 2
tar: Error exit delayed from previous errors
mv: cannot stat `clamav'job-working-directory: could not get current directory: getcwd: cannot access parent directories: No such file or directory
: No such file or directory
job-working-directory: could not get current directory: getcwd: cannot access parent directories: No such file or directory
tar: aps.tar.gz: Cannot open: No such file or directory
tar: Error is not recoverable: exiting now
tar: Child returned status 2
tar: Error exit delayed from previous errors
./setup2: line 860: ispconfig_tmp/php/bin/php: No such file or directory
job-working-directory: could not get current directory: getcwd: cannot access parent directories: No such file or directory
job-working-directory: could not get current directory: getcwd: cannot access parent directories: No such file or directory
ERROR: The PHP binary coming with ISPConfig does not work properly on your system! The installation routine stops here!
job-working-directory: could not get current directory: getcwd: cannot access parent directories: No such file or directory
Getting closer to a fix.

Thanks,
Spudchat

EDIT:

I remembered reading about this problem when others had it, so I searched the forum and found this thread:
http://www.howtoforge.com/forums/sho...ght=PHP+binary . I read it and checked my gcc version, as I am also using an x86 32bit processor. My gcc version is "gcc version 3.3.5 (Debian 1:3.3.5-13)".

EDIT 2:

I thought I might try again and install it, but now when I try it seems that it would like me to perform an installation as my /root/ispconfig directory was removed .

Last edited by Spudchat; 15th March 2007 at 20:27.
Reply With Quote