View Single Post
  #1  
Old 21st February 2007, 10:22
yogi183 yogi183 is offline
Junior Member
 
Join Date: Feb 2007
Posts: 4
Thanks: 0
Thanked 1 Time in 1 Post
Default Installation Error, Debian 3.1

hey i've tried installing ISPconfig on both ubuntu and debian, using the HotToForge guides, and following them exactly.

Currently at the point of installing ISPConfig in the Perfect Debian Setup http://www.howtoforge.com/perfect_setup_debian_sarge
this is the error i get

Quote:
ERMIO -O3 -fomit-frame-pointer -Wall -DOPENSSL_BN_ASM_PART_WORDS -DOPENSSL_IA32_SSE2 -DSHA1_ASM -DMD5_ASM -DRMD160_ASM -DAES_ASM -c -o sha512.o sha512.c
sha512.c: In function `sha512_block':
sha512.c:490: error: unrecognizable insn:
(insn 4983 4982 432 3 (nil) (set (reg 0 eax)
(subreg:SI (memI (plus:SI (reg/f:SI 7 esp)
(const_int 6208 [0x1840])) [105 S8 A8]) 0)) -1 (nil)
(nil))
sha512.c:490: internal compiler error: in extract_insn, at recog.c:2175
Please submit a full bug report,
with preprocessed source if appropriate.
See <URL:http://gcc.gnu.org/bugs.html> for instructions.
For Debian GNU/Linux specific bug reporting instructions, see
<URL:file:///usr/share/doc/gcc-3.3/README.Bugs>.
make[2]: *** [sha512.o] Error 1
make[2]: Leaving directory `/install_ispconfig/compile_aps/openssl-0.9.8a/crypto/sha'
make[1]: *** [subdirs] Error 1
make[1]: Leaving directory `/install_ispconfig/compile_aps/openssl-0.9.8a/crypto'
make: *** [build_crypto] Error 1
ERROR: Could not make OpenSSL
cd: could not get current directory: getcwd: cannot access parent directories: No such file or directory
cd: could not get current directory: getcwd: cannot access parent directories: No such file or directory
mv: cannot stat `binaries/aps.tar.gz'job-working-directory: could not get current directory: getcwd: cannot access parent directories: No such file or directory
: No such file or directory
mv: cannot stat `binaries/spamassassin.tar.gz'job-working-directory: could not get current directory: getcwd: cannot access parent directories: No such file or directory
: No such file or directory
job-working-directory: could not get current directory: getcwd: cannot access parent directories: No such file or directory
mv: cannot stat `binaries/uudeview.tar.gz': No such file or directory
mv: cannot stat `binaries/clamav.tar.gz': No such file or directory
job-working-directory: could not get current directory: getcwd: cannot access parent directories: No such file or directory
mv: cannot stat `binaries/cronolog': No such file or directory
job-working-directory: could not get current directory: getcwd: cannot access parent directories: No such file or directory
mv: cannot stat `binaries/cronosplit': No such file or directory
job-working-directory: could not get current directory: getcwd: cannot access parent directories: No such file or directory
mv: cannot stat `binaries/ispconfig_tcpserver': No such file or directory
job-working-directory: could not get current directory: getcwd: cannot access parent directories: No such file or directory
mv: cannot stat `binaries/zip': No such file or directory
job-working-directory: could not get current directory: getcwd: cannot access parent directories: No such file or directory
mv: cannot stat `binaries/unzip': No such file or directory
job-working-directory: could not get current directory: getcwd: cannot access parent directories: No such file or directory
tar: spamassassin.tar.gz: Cannot open: No such file or directory
tar: Error is not recoverable: exiting now
tar: Child returned status 2
tar: Error exit delayed from previous errors
job-working-directory: could not get current directory: getcwd: cannot access parent directories: No such file or directory
mv: cannot stat `spamassassin': No such file or directory
job-working-directory: could not get current directory: getcwd: cannot access parent directories: No such file or directory
tar: uudeview.tar.gz: Cannot open: No such file or directory
tar: Error is not recoverable: exiting now
tar: Child returned status 2
tar: Error exit delayed from previous errors
job-working-directory: could not get current directory: getcwd: cannot access parent directories: No such file or directory
mv: cannot stat `uudeview': No such file or directory
job-working-directory: could not get current directory: getcwd: cannot access parent directories: No such file or directory
tar: clamav.tar.gz: Cannot openjob-working-directory: could not get current directory: getcwd: cannot access parent directories: No such file or directory
: No such file or directory
tar: Error is not recoverable: exiting now
tar: Child returned status 2
tar: Error exit delayed from previous errors
mv: cannot stat `clamav'job-working-directory: could not get current directory: getcwd: cannot access parent directories: No such file or directory
: No such file or directory
job-working-directory: could not get current directory: getcwd: cannot access parent directories: No such file or directory
tar: aps.tar.gz: Cannot open: No such file or directory
tar: Error is not recoverable: exiting now
tar: Child returned status 2
tar: Error exit delayed from previous errors
job-working-directory: could not get current directory: getcwd: cannot access parent directories: No such file or directory
./setup2: line 794: ispconfig_tmp/php/bin/php: No such file or directory
ERROR: The PHP binary coming with ISPConfig does not work properly on your system! The installation routine stops here!
job-working-directory: could not get current directory: getcwd: cannot access parent directories: No such file or directory
any help would be greatly appreciated. Thank you in advance
Reply With Quote
Sponsored Links