View Single Post
  #9  
Old 26th April 2006, 22:14
Samatttv Samatttv is offline
Junior Member
 
Join Date: Apr 2006
Posts: 3
Thanks: 0
Thanked 0 Times in 0 Posts
Default

Hate to add to the issues here, but I'm stuck at a similar problem.

After doing a Perfect Install of Fedora 4, when I try to setup ISPConfig, I run into this:
Quote:
Configured for linux-elf.
making all in crypto...
make[1]: Entering directory `/root/install_ispconfig/compile_aps/openssl-0.9.8a/crypto'
( echo "#ifndef MK1MF_BUILD"; \
echo ' /* auto-generated by crypto/Makefile for crypto/cversion.c */'; \
echo ' #define CFLAGS "gcc -DOPENSSL_THREADS -D_REENTRANT -DDSO_DLFCN -DHAVE_DLFCN_H -DL_ENDIAN -DTERMIO -O3 -fomit-frame-pointer -Wall -DOPENSSL_BN_ASM_PART_WORDS -DOPENSSL_IA32_SSE2 -DSHA1_ASM -DMD5_ASM -DRMD160_ASM -DAES_ASM"'; \
echo ' #define PLATFORM "linux-elf"'; \
echo " #define DATE \"`LC_ALL=C LC_TIME=C date`\""; \
echo '#endif' ) >buildinf.h
gcc -I. -I.. -I../include -DOPENSSL_THREADS -D_REENTRANT -DDSO_DLFCN -DHAVE_DLFCN_H -DL_ENDIAN -DTERMIO -O3 -fomit-frame-pointer -Wall -DOPENSSL_BN_ASM_PART_WORDS -DOPENSSL_IA32_SSE2 -DSHA1_ASM -DMD5_ASM -DRMD160_ASM -DAES_ASM -c -o cryptlib.o cryptlib.c
make[1]: gcc: Command not found
make[1]: *** [cryptlib.o] Error 127
make[1]: Leaving directory `/root/install_ispconfig/compile_aps/openssl-0.9.8a/crypto'
make: *** [build_crypto] Error 1
ERROR: Could not make OpenSSL
cd: error retrieving current directory: getcwd: cannot access parent directories: No such file or directory
mv: cannot stat `binaries/aps.tar.gz': No such file or directory
mv: cannot stat `binaries/spamassassin.tar.gz': No such file or directory
mv: cannot stat `binaries/uudeview.tar.gz': No such file or directory
mv: cannot stat `binaries/clamav.tar.gz': No such file or directory
mv: cannot stat `binaries/cronolog': No such file or directory
mv: cannot stat `binaries/cronosplit': No such file or directory
mv: cannot stat `binaries/ispconfig_tcpserver': No such file or directory
mv: cannot stat `binaries/zip': No such file or directory
mv: cannot stat `binaries/unzip': No such file or directory
tar: spamassassin.tar.gz: Cannot open: No such file or directory
tar: Error is not recoverable: exiting now
tar: Child returned status 2
tar: Error exit delayed from previous errors
mv: cannot stat `spamassassin': No such file or directory
tar: uudeview.tar.gz: Cannot open: No such file or directory
tar: Error is not recoverable: exiting now
tar: Child returned status 2
tar: Error exit delayed from previous errors
mv: cannot stat `uudeview': No such file or directory
tar: clamav.tar.gz: Cannot open: No such file or directory
tar: Error is not recoverable: exiting now
tar: Child returned status 2
tar: Error exit delayed from previous errors
mv: cannot stat `clamav': No such file or directory
tar: aps.tar.gz: Cannot open: No such file or directory
tar: Error is not recoverable: exiting now
tar: Child returned status 2
tar: Error exit delayed from previous errors
./setup2: line 794: ispconfig_tmp/php/bin/php: No such file or directory
ERROR: The PHP binary coming with ISPConfig does not work properly on your system! The installation routine stops here!
Thanks for any help.
Reply With Quote