View Single Post
  #2  
Old 29th August 2005, 20:21
till till is offline
Super Moderator
 
Join Date: Apr 2005
Location: Lüneburg, Germany
Posts: 36,411
Thanks: 834
Thanked 5,496 Times in 4,326 Posts
Default

Quote:
Originally Posted by adamluz
I am getting the follow error which I did not get with 2.0.7

In file included from sha512.c:44:
/usr/include/stdlib.h:140: internal compiler error: Segmentation fault
Please submit a full bug report,
with preprocessed source if appropriate.
See <URL:http://bugzilla.redhat.com/bugzilla> for instructions.
The bug is not reproducible, so it is likely a hardware or OS problem.
make[2]: *** [sha512.o] Error 1
make[2]: Leaving directory `/root/install_ispconfig/compile_aps/openssl-0.9.8/crypto/sha'
make[1]: *** [subdirs] Error 1
make[1]: Leaving directory `/root/install_ispconfig/compile_aps/openssl-0.9.8/crypto'
make: *** [build_crypto] Error 1
ERROR: Could not make OpenSSL

This error occured after typing ./setup
Remove the install_ispconfig directory, unpack the installer again and run the setup script again. Maybe that solves the error.
Reply With Quote