View Single Post
  #1  
Old 29th August 2005, 20:59
adamluz adamluz is offline
Member
 
Join Date: Aug 2005
Location: Burbank, California
Posts: 76
Thanks: 0
Thanked 0 Times in 0 Posts
Send a message via AIM to adamluz Send a message via MSN to adamluz
Default ERROR While upgrading to 2.0.8

I am getting the follow error which I did not get with 2.0.7

In file included from sha512.c:44:
/usr/include/stdlib.h:140: internal compiler error: Segmentation fault
Please submit a full bug report,
with preprocessed source if appropriate.
See <URL:http://bugzilla.redhat.com/bugzilla> for instructions.
The bug is not reproducible, so it is likely a hardware or OS problem.
make[2]: *** [sha512.o] Error 1
make[2]: Leaving directory `/root/install_ispconfig/compile_aps/openssl-0.9.8/crypto/sha'
make[1]: *** [subdirs] Error 1
make[1]: Leaving directory `/root/install_ispconfig/compile_aps/openssl-0.9.8/crypto'
make: *** [build_crypto] Error 1
ERROR: Could not make OpenSSL

This error occured after typing ./setup
Reply With Quote
Sponsored Links