Thread: ruby errors
View Single Post
  #1  
Old 11th June 2009, 16:08
-crisstm- -crisstm- is offline
Banned
 
Join Date: Jul 2008
Posts: 78
Thanks: 3
Thanked 1 Time in 1 Post
Default ruby errors

i install centos 5.3 x86_64 and i have one error after install ruby cmd make

apachelib.c: In function ‘ap_chdir_file’:
apachelib.c:149: warning: ignoring return value of ‘chdir’, declared with attribute warn_unused_result
apachelib.c:154: warning: ignoring return value of ‘chdir’, declared with attribute warn_unused_result
apachelib.c: In function ‘rb_init_apache’:
apachelib.c:374: error: ‘OPT_INCNOEXEC’ undeclared (first use in this function)
apachelib.c:374: error: (Each undeclared identifier is reported only once
apachelib.c:374: error: for each function it appears in.)
make: *** [apachelib.o] Error 1

after that i cannot use apache because doesn't find mod_ruby.so file
can anyone help me?
Reply With Quote
Sponsored Links