View Single Post
  #9  
Old 10th February 2006, 14:26
cksrealm cksrealm is offline
Junior Member
 
Join Date: Nov 2005
Posts: 9
Thanks: 0
Thanked 0 Times in 0 Posts
Default

The output from the section prior to this is shown below.

Configured for linux-elf.
making all in crypto...
make[1]: Entering directory `/var/www/install_ispconfig/compile_aps/openssl-0.9.8/crypto'
( echo "#ifndef MK1MF_BUILD"; \
echo ' /* auto-generated by crypto/Makefile for crypto/cversion.c */'; \
echo ' #define CFLAGS "gcc -DOPENSSL_THREADS -D_REENTRANT -DDSO_DLFCN -DHAVE_DLFCN_H -DL_ENDIAN -DTERMIO -O3 -fomit-frame-pointer -Wall -DOPENSSL_BN_ASM_PART_WORDS -DOPENSSL_IA32_SSE2 -DSHA1_ASM -DMD5_ASM -DRMD160_ASM -DAES_ASM"'; \
echo ' #define PLATFORM "linux-elf"'; \
echo " #define DATE \"`LC_ALL=C LC_TIME=C date`\""; \
echo '#endif' ) >buildinf.h
gcc -I. -I.. -I../include -DOPENSSL_THREADS -D_REENTRANT -DDSO_DLFCN -DHAVE_DLFCN_H -DL_ENDIAN -DTERMIO -O3 -fomit-frame-pointer -Wall -DOPENSSL_BN_ASM_PART_WORDS -DOPENSSL_IA32_SSE2 -DSHA1_ASM -DMD5_ASM -DRMD160_ASM -DAES_ASM -c -o cryptlib.o cryptlib.c
In file included from cryptlib.c:117:
cryptlib.h:62:20: error: stdlib.h: No such file or directory
cryptlib.h:63:20: error: string.h: No such file or directory
In file included from cryptlib.h:65,
from cryptlib.c:117:
../e_os.h:392:30: error: unistd.h: No such file or directory
../e_os.h:397:29: error: sys/types.h: No such file or directory
../e_os.h:621:25: error: strings.h: No such file or directory
In file included from cryptlib.h:72,
from cryptlib.c:117:
../include/openssl/crypto.h:125:19: error: stdio.h: No such file or directory
In file included from cryptlib.h:72,
from cryptlib.c:117:
../include/openssl/crypto.h:175: error: syntax error before 'size_t'
../include/openssl/crypto.h:175: warning: no semicolon at end of struct or union
../include/openssl/crypto.h:176: warning: type defaults to 'int' in declaration of 'value_length'
../include/openssl/crypto.h:176: warning: data definition has no type or storage class
../include/openssl/crypto.h:177: error: syntax error before '}' token
../include/openssl/crypto.h:177: warning: type defaults to 'int' in declaration of 'OPENSSL_ITEM'
../include/openssl/crypto.h:177: warning: data definition has no type or storage class
../include/openssl/crypto.h:442: warning: parameter names (without types) in function declaration
../include/openssl/crypto.h:442: error: syntax error before 'size_t'
../include/openssl/crypto.h:443: warning: parameter names (without types) in function declaration
../include/openssl/crypto.h:444: error: syntax error before 'const'
../include/openssl/crypto.h:445: error: syntax error before 'size_t'
../include/openssl/crypto.h:447: error: syntax error before 'const'
../include/openssl/crypto.h:454: warning: parameter names (without types) in function declaration
../include/openssl/crypto.h:454: error: syntax error before 'size_t'
../include/openssl/crypto.h:455: warning: parameter names (without types) in function declaration
../include/openssl/crypto.h:456: error: syntax error before 'const'
../include/openssl/crypto.h:457: error: syntax error before 'size_t'
../include/openssl/crypto.h:459: error: syntax error before 'const'
../include/openssl/crypto.h:476: error: syntax error before 'size_t'
../include/openssl/crypto.h:511: error: syntax error before '*' token
In file included from cryptlib.h:74,
from cryptlib.c:117:
../include/openssl/bio.h:562: error: syntax error before '*' token
../include/openssl/bio.h:639: error: syntax error before '*' token
../include/openssl/bio.h:640: error: syntax error before '*' token
In file included from ../include/openssl/err.h:74,
from cryptlib.h:75,
from cryptlib.c:117:
../include/openssl/lhash.h:185: error: syntax error before 'FILE'
../include/openssl/lhash.h:186: error: syntax error before 'FILE'
../include/openssl/lhash.h:187: error: syntax error before 'FILE'
In file included from cryptlib.h:75,
from cryptlib.c:117:
../include/openssl/err.h:87:19: error: errno.h: No such file or directory
In file included from cryptlib.h:75,
from cryptlib.c:117:
../include/openssl/err.h:279: error: syntax error before '*' token
cryptlib.c: In function 'CRYPTO_thread_id':
cryptlib.c:440: warning: implicit declaration of function 'getpid'
cryptlib.c: In function 'OPENSSL_cpuid_setup':
cryptlib.c:559: warning: implicit declaration of function 'getenv'
cryptlib.c:559: warning: assignment makes pointer from integer without a cast
cryptlib.c:560: warning: implicit declaration of function 'strtoul'
cryptlib.c: In function 'OPENSSL_showfatal':
cryptlib.c:754: warning: implicit declaration of function 'vfprintf'
cryptlib.c:754: error: 'stderr' undeclared (first use in this function)
cryptlib.c:754: error: (Each undeclared identifier is reported only once
cryptlib.c:754: error: for each function it appears in.)
cryptlib.c: In function 'OpenSSLDie':
cryptlib.c:765: warning: implicit declaration of function 'abort'
cryptlib.c:765: warning: incompatible implicit declaration of built-in function 'abort'
cryptlib.c: In function 'OPENSSL_stderr':
cryptlib.c:768: error: 'stderr' undeclared (first use in this function)
make[1]: *** [cryptlib.o] Error 1
make[1]: Leaving directory `/var/www/install_ispconfig/compile_aps/openssl-0.9.8/crypto'
make: *** [build_crypto] Error 1
ERROR: Could not make OpenSSL


Also the system date/time are all correct as well.

Kind Regards

Chris K
Reply With Quote