View Single Post
  #7  
Old 31st August 2008, 16:51
commentator commentator is offline
Senior Member
 
Join Date: Jul 2008
Location: The Netherlands
Posts: 143
Thanks: 48
Thanked 7 Times in 5 Posts
Default

Upgrade works ok on debian etch

Upgrade not working on debian lenny.

Quote:
make[1]: Entering directory `/tmp/install_ispconfig/compile_aps/openssl-0.9.7m/crypto'
( echo "#ifndef MK1MF_BUILD"; \
echo ' /* auto-generated by crypto/Makefile for crypto/cversion.c */'; \
echo ' #define CFLAGS "gcc -DOPENSSL_THREADS -D_REENTRANT -DDSO_DLFCN -DHAVE_DLFCN_H -DOPENSSL_NO_KRB5 -DL_ENDIAN -DTERMIO -O3 -fomit-frame-pointer -m486 -Wall -DSHA1_ASM -DMD5_ASM -DRMD160_ASM"'; \
echo ' #define PLATFORM "linux-elf"'; \
echo " #define DATE \"`LC_ALL=C LC_TIME=C date`\""; \
echo '#endif' ) >buildinf.h
gcc -I. -I.. -I../include -DOPENSSL_THREADS -D_REENTRANT -DDSO_DLFCN -DHAVE_DLFCN_H -DOPENSSL_NO_KRB5 -DL_ENDIAN -DTERMIO -O3 -fomit-frame-pointer -m486 -Wall -DSHA1_ASM -DMD5_ASM -DRMD160_ASM -c -o cryptlib.o cryptlib.c
cc1: error: unrecognized command line option "-m486"
make[1]: *** [cryptlib.o] Error 1
make[1]: Leaving directory `/tmp/install_ispconfig/compile_aps/openssl-0.9.7m/crypto'
make: *** [sub_all] Error 1
ERROR: Could not make OpenSSL
cd: error retrieving current directory: getcwd: cannot access parent directories: No such file or directory
mv: cannot stat `binaries/aps.tar.gz': No such file or directory
mv: cannot stat `binaries/spamassassin.tar.gz': No such file or directory
mv: cannot stat `binaries/uudeview.tar.gz': No such file or directory
mv: cannot stat `binaries/clamav.tar.gz': No such file or directory
mv: cannot stat `binaries/cronolog': No such file or directory
mv: cannot stat `binaries/cronosplit': No such file or directory
mv: cannot stat `binaries/ispconfig_tcpserver': No such file or directory
mv: cannot stat `binaries/zip': No such file or directory
mv: cannot stat `binaries/unzip': No such file or directory
tar: spamassassin.tar.gz: Cannot open: No such file or directory
tar: Error is not recoverable: exiting now
tar: Child returned status 2
tar: Error exit delayed from previous errors
mv: cannot stat `spamassassin': No such file or directory
tar: uudeview.tar.gz: Cannot open: No such file or directory
tar: Error is not recoverable: exiting now
tar: Child returned status 2
tar: Error exit delayed from previous errors
mv: cannot stat `uudeview': No such file or directory
tar: clamav.tar.gz: Cannot open: No such file or directory
tar: Error is not recoverable: exiting now
tar: Child returned status 2
tar: Error exit delayed from previous errors
mv: cannot stat `clamav': No such file or directory
tar: aps.tar.gz: Cannot open: No such file or directory
tar: Error is not recoverable: exiting now
tar: Child returned status 2
tar: Error exit delayed from previous errors
./setup2: line 888: ispconfig_tmp/php/bin/php: No such file or directory
ERROR: The PHP binary coming with ISPConfig does not work properly on your system! The installation routine stops here!
Reply With Quote