View Single Post
  #7  
Old 18th June 2008, 17:10
dtech dtech is offline
Junior Member
 
Join Date: Jun 2008
Posts: 9
Thanks: 0
Thanked 0 Times in 0 Posts
Default

I'm a little bit further. But I still get an error. Here's what I did:
Code:
# Remove gcc 4.2
apt-get remove gcc g++

# Install gcc 3.4
apt-get install gcc-3.4 g++-3.4

# Make symbolic links
ln -s /usr/bin/gcc-3.4 /usr/bin/gcc
ln -s /usr/bin/g++-3.4 /usr/bin/g++

# Install AMD64 libraries
apt-get install libc-amd64 libc6-dev-amd64
It seemed to go on a bit longer, but I get the following error now:
Code:
gcc -DMONOLITH -I.. -I../include  -DOPENSSL_THREADS -D_REENTRANT -DDSO_DLFCN -DHAVE_DLFCN_H -DOPENSSL_NO_KRB5 -m64 -DL_ENDIAN -DTERMIO -O3 -Wall -DMD32_REG_T=int   -c -o openssl.o openssl.c
rm -f openssl
+ gcc -o openssl -DMONOLITH -I.. -I../include -DOPENSSL_THREADS -D_REENTRANT -DDSO_DLFCN -DHAVE_DLFCN_H -DOPENSSL_NO_KRB5 -m64 -DL_ENDIAN -DTERMIO -O3 -Wall -DMD32_REG_T=int openssl.o verify.o asn1pars.o req.o dgst.o dh.o dhparam.o enc.o passwd.o gendh.o errstr.o ca.o pkcs7.o crl2p7.o crl.o rsa.o rsautl.o dsa.o dsaparam.o x509.o genrsa.o gendsa.o s_server.o s_client.o speed.o s_time.o apps.o s_cb.o s_socket.o app_rand.o version.o sess_id.o ciphers.o nseq.o pkcs12.o pkcs8.o spkac.o smime.o rand.o engine.o ocsp.o prime.o ../libssl.a ../libcrypto.a -ldl
/usr/bin/ld: cannot find -lgcc_s_64
collect2: ld returned 1 exit status
make[1]: *** [openssl] Error 1
make[1]: Leaving directory `/root/install_ispconfig/compile_aps/openssl-0.9.7m/apps'
make: *** [sub_all] Error 1
ERROR: Could not make OpenSSL
cd: error retrieving current directory: getcwd: cannot access parent directories: No such file or directory
mv: cannot stat `binaries/aps.tar.gz': No such file or directory
mv: cannot stat `binaries/spamassassin.tar.gz': No such file or directory
mv: cannot stat `binaries/uudeview.tar.gz': No such file or directory
mv: cannot stat `binaries/clamav.tar.gz': No such file or directory
mv: cannot stat `binaries/cronolog': No such file or directory
mv: cannot stat `binaries/cronosplit': No such file or directory
mv: cannot stat `binaries/ispconfig_tcpserver': No such file or directory
mv: cannot stat `binaries/zip': No such file or directory
mv: cannot stat `binaries/unzip': No such file or directory
tar: spamassassin.tar.gz: Cannot open: No such file or directory
tar: Error is not recoverable: exiting now
tar: Child returned status 2
tar: Error exit delayed from previous errors
mv: cannot stat `spamassassin': No such file or directory
tar: uudeview.tar.gz: Cannot open: No such file or directory
tar: Error is not recoverable: exiting now
tar: Child returned status 2
tar: Error exit delayed from previous errors
mv: cannot stat `uudeview': No such file or directory
tar: clamav.tar.gz: Cannot open: No such file or directory
tar: Error is not recoverable: exiting now
tar: Child returned status 2
tar: Error exit delayed from previous errors
mv: cannot stat `clamav': No such file or directory
tar: aps.tar.gz: Cannot open: No such file or directory
tar: Error is not recoverable: exiting now
tar: Child returned status 2
tar: Error exit delayed from previous errors
./setup2: line 888: ispconfig_tmp/php/bin/php: No such file or directory
ERROR: The PHP binary coming with ISPConfig does not work properly on your system! The installation routine stops here!
Reply With Quote