View Single Post
  #6  
Old 18th June 2008, 17:25
dtech dtech is offline
Junior Member
 
Join Date: Jun 2008
Posts: 9
Thanks: 0
Thanked 0 Times in 0 Posts
Default

I've gotten a fresh image and changed the apt configuration from the start.
Code:
make[1]: Leaving directory `/root/install_ispconfig/compile_aps/openssl-0.9.7m/test'
making links in tools...
make[1]: Entering directory `/root/install_ispconfig/compile_aps/openssl-0.9.7m/tools'
make[1]: Nothing to be done for `links'.
make[1]: Leaving directory `/root/install_ispconfig/compile_aps/openssl-0.9.7m/tools'
generating dummy tests (if needed)...
make[1]: Entering directory `/root/install_ispconfig/compile_aps/openssl-0.9.7m/test'
make[1]: Nothing to be done for `generate'.
make[1]: Leaving directory `/root/install_ispconfig/compile_aps/openssl-0.9.7m/test'

Configured for linux-x86_64.
making all in crypto...
make[1]: Entering directory `/root/install_ispconfig/compile_aps/openssl-0.9.7m/crypto'
( echo "#ifndef MK1MF_BUILD"; \
        echo '  /* auto-generated by crypto/Makefile for crypto/cversion.c */'; \
        echo '  #define CFLAGS "gcc -DOPENSSL_THREADS -D_REENTRANT -DDSO_DLFCN -DHAVE_DLFCN_H -DOPENSSL_NO_KRB5 -m64 -DL_ENDIAN -DTERMIO -O3 -Wall -DMD32_REG_T=int"'; \
        echo '  #define PLATFORM "linux-x86_64"'; \
        echo "  #define DATE \"`LC_ALL=C LC_TIME=C date`\""; \
        echo '#endif' ) >buildinf.h
gcc -I. -I.. -I../include -DOPENSSL_THREADS -D_REENTRANT -DDSO_DLFCN -DHAVE_DLFCN_H -DOPENSSL_NO_KRB5 -m64 -DL_ENDIAN -DTERMIO -O3 -Wall -DMD32_REG_T=int   -c -o cryptlib.o cryptlib.c
In file included from /usr/include/features.h:354,
                 from /usr/include/stdio.h:28,
                 from cryptlib.c:59:
/usr/include/gnu/stubs.h:9:27: error: gnu/stubs-64.h: No such file or directory
cryptlib.c: In function 'CRYPTO_get_new_dynlockid':
cryptlib.c:221: warning: value computed is not used
cryptlib.c: In function 'CRYPTO_destroy_dynlockid':
cryptlib.c:263: warning: value computed is not used
make[1]: *** [cryptlib.o] Error 1
make[1]: Leaving directory `/root/install_ispconfig/compile_aps/openssl-0.9.7m/crypto'
make: *** [sub_all] Error 1
ERROR: Could not make OpenSSL
cd: error retrieving current directory: getcwd: cannot access parent directories: No such file or directory
mv: cannot stat `binaries/aps.tar.gz': No such file or directory
mv: cannot stat `binaries/spamassassin.tar.gz': No such file or directory
mv: cannot stat `binaries/uudeview.tar.gz': No such file or directory
mv: cannot stat `binaries/clamav.tar.gz': No such file or directory
mv: cannot stat `binaries/cronolog': No such file or directory
mv: cannot stat `binaries/cronosplit': No such file or directory
mv: cannot stat `binaries/ispconfig_tcpserver': No such file or directory
mv: cannot stat `binaries/zip': No such file or directory
mv: cannot stat `binaries/unzip': No such file or directory
tar: spamassassin.tar.gz: Cannot open: No such file or directory
tar: Error is not recoverable: exiting now
tar: Child returned status 2
tar: Error exit delayed from previous errors
mv: cannot stat `spamassassin': No such file or directory
tar: uudeview.tar.gz: Cannot open: No such file or directory
tar: Error is not recoverable: exiting now
tar: Child returned status 2
tar: Error exit delayed from previous errors
mv: cannot stat `uudeview': No such file or directory
tar: clamav.tar.gz: Cannot open: No such file or directory
tar: Error is not recoverable: exiting now
tar: Child returned status 2
tar: Error exit delayed from previous errors
mv: cannot stat `clamav': No such file or directory
tar: aps.tar.gz: Cannot open: No such file or directory
tar: Error is not recoverable: exiting now
tar: Child returned status 2
tar: Error exit delayed from previous errors
./setup2: line 888: ispconfig_tmp/php/bin/php: No such file or directory
ERROR: The PHP binary coming with ISPConfig does not work properly on your system! The installation routine stops here!
Do I have such a strange installation?

Last edited by dtech; 18th June 2008 at 17:29. Reason: gcc 3.4 not installed
Reply With Quote