View Single Post
  #1  
Old 3rd May 2008, 23:19
DocProc DocProc is offline
Junior Member
 
Join Date: May 2008
Posts: 8
Thanks: 0
Thanked 0 Times in 0 Posts
Unhappy ubuntu 8.04 server installation of ispconfig fails

Hello there...


i'm just setting up a ubuntu 8.04 server (alternate install cd) and followed the "perfect server setup" to the letter (!) but the installation of ispconfig fails with the following error (see below)

is there anyone who can help me?

thanks a lot in advance!

Doc

Quote:
make[2]: Leaving directory `/home/server/install_ispconfig/compile_aps/openssl-0.9.7m/crypto/engine'
making all in crypto/aes...
make[2]: Entering directory `/home/server/install_ispconfig/compile_aps/openssl-0.9.7m/crypto/aes'
gcc -I.. -I../.. -I../../include -DOPENSSL_THREADS -D_REENTRANT -DDSO_DLFCN -DHAVE_DLFCN_H -DOPENSSL_NO_KRB5 -DL_ENDIAN -DTERMIO -O3 -fomit-frame-pointer -march=pentium -Wall -DSHA1_ASM -DMD5_ASM -DRMD160_ASM -c -o aes_core.o aes_core.c
aes_core.c: In function ‚AES_decrypt‚:
aes_core.c:975: internal compiler error: Segmentation fault
Please submit a full bug report,
with preprocessed source if appropriate.
See <URL:http://gcc.gnu.org/bugs.html> for instructions.
For Debian GNU/Linux specific bug reporting instructions,
see <URL:file:///usr/share/doc/gcc-4.2/README.Bugs>.
make[2]: *** [aes_core.o] Error 1
make[2]: Leaving directory `/home/server/install_ispconfig/compile_aps/openssl-0.9.7m/crypto/aes'
make[1]: *** [subdirs] Error 1
make[1]: Leaving directory `/home/server/install_ispconfig/compile_aps/openssl-0.9.7m/crypto'
make: *** [sub_all] Error 1
ERROR: Could not make OpenSSL
cd: error retrieving current directory: getcwd: cannot access parent directories: No such file or directory
mv: cannot stat `binaries/aps.tar.gz': No such file or directory
mv: cannot stat `binaries/spamassassin.tar.gz': No such file or directory
mv: cannot stat `binaries/uudeview.tar.gz': No such file or directory
mv: cannot stat `binaries/clamav.tar.gz': No such file or directory
mv: cannot stat `binaries/cronolog': No such file or directory
mv: cannot stat `binaries/cronosplit': No such file or directory
mv: cannot stat `binaries/ispconfig_tcpserver': No such file or directory
mv: cannot stat `binaries/zip': No such file or directory
mv: cannot stat `binaries/unzip': No such file or directory
tar: spamassassin.tar.gz: Cannot open: No such file or directory
tar: Error is not recoverable: exiting now
tar: Child returned status 2
tar: Error exit delayed from previous errors
mv: cannot stat `spamassassin': No such file or directory
tar: uudeview.tar.gz: Cannot open: No such file or directory
tar: Error is not recoverable: exiting now
tar: Child returned status 2
tar: Error exit delayed from previous errors
mv: cannot stat `uudeview': No such file or directory
tar: clamav.tar.gz: Cannot open: No such file or directory
tar: Error is not recoverable: exiting now
tar: Child returned status 2
tar: Error exit delayed from previous errors
mv: cannot stat `clamav': No such file or directory
tar: aps.tar.gz: Cannot open: No such file or directory
tar: Error is not recoverable: exiting now
tar: Child returned status 2
tar: Error exit delayed from previous errors
./setup2: line 888: ispconfig_tmp/php/bin/php: No such file or directory
ERROR: Das mitgelieferte PHP-Binary funktioniert auf Ihrem System nicht! Die Installation bricht hier ab!
Reply With Quote
Sponsored Links