HowtoForge Forums | HowtoForge - Linux Howtos and Tutorials

HowtoForge Forums | HowtoForge - Linux Howtos and Tutorials (http://www.howtoforge.com/forums/index.php)
-   Installation/Configuration (http://www.howtoforge.com/forums/forumdisplay.php?f=16)
-   -   Installing 2.2.1 and stopped with errors (http://www.howtoforge.com/forums/showthread.php?t=3894)

djtremors 24th April 2006 15:12

Installing 2.2.1 and stopped with errors
 
Hi all,

I was hoping to get it first go but alas no way.

I'm running on Fedora Core 5 and it appears to have died trying to congifure possibly PHP with MySQL support but php 5 doesn't come with mysql support built in anymore so it dies. Anyone got this?

Code:

checking for MING support... no
checking for msession support... no
checking for mSQL support... no
checking for MSSQL support via FreeTDS... no
checking for MySQL support... yes
checking for specified location of the MySQL UNIX socket... no
checking for MySQL UNIX socket location... no
configure: error: Cannot find MySQL header files under /usr.
Note that the MySQL client library is not bundled anymore!
ERROR: Could not configure PHP
cd: error retrieving current directory: getcwd: cannot access parent directories: No such file or directory
mv: cannot stat `binaries/aps.tar.gz': No such file or directory
mv: cannot stat `binaries/spamassassin.tar.gz': No such file or directory
mv: cannot stat `binaries/uudeview.tar.gz': No such file or directory
mv: cannot stat `binaries/clamav.tar.gz': No such file or directory
mv: cannot stat `binaries/cronolog': No such file or directory
mv: cannot stat `binaries/cronosplit': No such file or directory
mv: cannot stat `binaries/ispconfig_tcpserver': No such file or directory
mv: cannot stat `binaries/zip': No such file or directory
mv: cannot stat `binaries/unzip': No such file or directory
tar: spamassassin.tar.gz: Cannot open: No such file or directory
tar: Error is not recoverable: exiting now
tar: Child returned status 2
tar: Error exit delayed from previous errors
mv: cannot stat `spamassassin': No such file or directory
tar: uudeview.tar.gz: Cannot open: No such file or directory
tar: Error is not recoverable: exiting now
tar: Child returned status 2
tar: Error exit delayed from previous errors
mv: cannot stat `uudeview': No such file or directory
tar: clamav.tar.gz: Cannot open: No such file or directory
tar: Error is not recoverable: exiting now
tar: Child returned status 2
tar: Error exit delayed from previous errors
mv: cannot stat `clamav': No such file or directory
tar: aps.tar.gz: Cannot open: No such file or directory
tar: Error is not recoverable: exiting now
tar: Child returned status 2
tar: Error exit delayed from previous errors
./setup2: line 794: ispconfig_tmp/php/bin/php: No such file or directory
ERROR: The PHP binary coming with ISPConfig does not work properly on your system! The installation routine stops here!


frbnet 24th April 2006 16:31

Installing 2.2.1 and stopped with errors
 
I got the same problem here:mad:

falko 24th April 2006 20:26

The mysql-devel package is missing. Please run
Code:

yum install mysql mysql-devel mysql-server
as described on http://www.howtoforge.com/perfect_se...dora_core_5_p4

djtremors 25th April 2006 01:33

Well thats interesting. I had mysql on there before as I also had phpmyadmin working fine. It appears that mysql-devel was missing and now it compiling. waiting for next failure now ;)

To save people 20 minutes of waiting for this to compile, can you add a prerequisite test to make sure all standard requirements are available? I know there's alot of distros to cover but we know there's standard package managers between them all. ie rpm,yum,deb etc... that would enough to cover most.
Even if you can check some simple things that may be enough to tell people know what they've missed...
(my 2 cents + GST ;) )


PS: This looks to be a nice open version of hosting services. Hopefully I'll be able to catch up soon and understand it's structure then contribute to the community :D I've used cpanel, plesk, virtualmin and know the goods and bads of all of them as I've put them all to the crunch and upset with them all due to lack of feature here and there.

mr.tank 25th April 2006 14:30

i have to a problem like this on fedora core 5 but is not the same problem..

here is the code:

Quote:

no-gmp [default] OPENSSL_NO_GMP (skip dir)
no-krb5 [krb5-flavor not specified] OPENSSL_NO_KRB5
no-mdc2 [default] OPENSSL_NO_MDC2 (skip dir)
no-rc5 [default] OPENSSL_NO_RC5 (skip dir)
no-shared [default]
no-zlib [default]
no-zlib-dynamic [default]
IsMK1MF=0
CC =gcc
CFLAG =-DOPENSSL_THREADS -D_REENTRANT -DDSO_DLFCN -DHAVE_DLFCN_H -mcpu=pentium -DL_ENDIAN -DTERMIO -O3 -fomit-frame-pointer -Wall -DOPENSSL_BN_ASM_PART_WORDS -DOPENSSL_IA32_SSE2 -DSHA1_ASM -DMD5_ASM -DRMD160_ASM -DAES_ASM
EX_LIBS =-ldl
CPUID_OBJ =x86cpuid-elf.o
BN_ASM =bn86-elf.o co86-elf.o
DES_ENC =dx86-elf.o yx86-elf.o
AES_ASM_OBJ =ax86-elf.o
BF_ENC =bx86-elf.o
CAST_ENC =cx86-elf.o
RC4_ENC =rx86-elf.o
RC5_ENC =r586-elf.o
MD5_OBJ_ASM =mx86-elf.o
SHA1_OBJ_ASM =sx86-elf.o s512sse2-elf.o
RMD160_OBJ_ASM=rm86-elf.o
PROCESSOR =
RANLIB =/usr/bin/ranlib
ARFLAGS =
PERL =/usr/bin/perl5
THIRTY_TWO_BIT mode
DES_PTR used
DES_RISC1 used
DES_UNROLL used
BN_LLONG mode
RC4_INDEX mode
RC4_CHUNK is undefined
make: Warning: File `Makefile.org' has modification time 8,7e+07 s in the futureMakefile is older than Makefile.org, Configure or config.
Reconfigure the source tree (via './config' or 'perl Configure'), please.
make: *** [Makefile] Fehler 1
make: Warning: File `Makefile.org' has modification time 8,7e+07 s in the futureMakefile is older than Makefile.org, Configure or config.
Reconfigure the source tree (via './config' or 'perl Configure'), please.
make: *** [Makefile] Fehler 1
ERROR: Could not make OpenSSL
cd: error retrieving current directory: getcwd: cannot access parent directories: Datei oder Verzeichnis nicht gefunden
mv: Aufruf von stat für „binaries/aps.tar.gz“ nicht möglich: Datei oder Verzeichnis nicht gefunden
mv: Aufruf von stat für „binaries/spamassassin.tar.gz“ nicht möglich: Datei oder Verzeichnis nicht gefunden
mv: Aufruf von stat für „binaries/uudeview.tar.gz“ nicht möglich: Datei oder Verzeichnis nicht gefunden
mv: Aufruf von stat für „binaries/clamav.tar.gz“ nicht möglich: Datei oder Verzeichnis nicht gefunden
mv: Aufruf von stat für „binaries/cronolog“ nicht möglich: Datei oder Verzeichnis nicht gefunden
mv: Aufruf von stat für „binaries/cronosplit“ nicht möglich: Datei oder Verzeichnis nicht gefunden
mv: Aufruf von stat für „binaries/ispconfig_tcpserver“ nicht möglich: Datei oder Verzeichnis nicht gefunden
mv: Aufruf von stat für „binaries/zip“ nicht möglich: Datei oder Verzeichnis nicht gefunden
mv: Aufruf von stat für „binaries/unzip“ nicht möglich: Datei oder Verzeichnis nicht gefunden
tar: spamassassin.tar.gz: Kann open nicht ausführen.: Datei oder Verzeichnis nicht gefunden
tar: Nicht behebbarer Fehler: Programmabbruch.
tar: Child returned status 2
tar: Fehler beim Beenden, verursacht durch vorhergehende Fehler.
mv: Aufruf von stat für „spamassassin“ nicht möglich: Datei oder Verzeichnis nicht gefunden
tar: uudeview.tar.gz: Kann open nicht ausführen.: Datei oder Verzeichnis nicht gefunden
tar: Nicht behebbarer Fehler: Programmabbruch.
tar: Child returned status 2
tar: Fehler beim Beenden, verursacht durch vorhergehende Fehler.
mv: Aufruf von stat für „uudeview“ nicht möglich: Datei oder Verzeichnis nicht gefunden
tar: clamav.tar.gz: Kann open nicht ausführen.: Datei oder Verzeichnis nicht gefunden
tar: Nicht behebbarer Fehler: Programmabbruch.
tar: Child returned status 2
tar: Fehler beim Beenden, verursacht durch vorhergehende Fehler.
mv: Aufruf von stat für „clamav“ nicht möglich: Datei oder Verzeichnis nicht gefunden
tar: aps.tar.gz: Kann open nicht ausführen.: Datei oder Verzeichnis nicht gefunden
tar: Nicht behebbarer Fehler: Programmabbruch.
tar: Child returned status 2
tar: Fehler beim Beenden, verursacht durch vorhergehende Fehler.
./setup2: line 794: ispconfig_tmp/php/bin/php: Datei oder Verzeichnis nicht gefunden
ERROR: Das mitgelieferte PHP-Binary funktioniert auf Ihrem System nicht! Die Installation bricht hier ab!
[root@localhost install_ispconfig]#

thanks for helping me and sorry for bad english :)

falko 25th April 2006 15:39

Quote:

make: Warning: File `Makefile.org' has modification time 8,7e+07 s in the futureMakefile is older than Makefile.org, Configure or config.
Your system time is wrong. Please correct it and try again.

mr.tank 25th April 2006 18:37

o my god... what a shame... :) i hate my biosbatterie.... thanks :)

but the storry goes on....

it is installing for over 20min and stops whit:

Quote:

checking for /tmp/clamd... no
configure: ClamAV version 0.88.1 detected.
configure: Using scanner /home/admispconfig/ispconfig/tools/clamav/bin/clamscan
configure: Using scanner options --no-summary --stdout --mbox
configure: Using virus signature file dir /home/admispconfig/ispconfig/tools/cla mav/share/clamav
configure: Signature version reporting is off.
configure: Scanner name adding is on.
configure: Using temporary directory /tmp
configure: Subject header rewriting is off.
configure: creating ./config.status
config.status: creating clamassassin
config.status: creating Makefile
cp -f clamassassin /home/admispconfig/ispconfig/tools/clamav/bin
chmod 555 /home/admispconfig/ispconfig/tools/clamav/bin/clamassassin
Can't locate ExtUtils/MakeMaker.pm in @INC (@INC contains: /usr/lib/perl5/5.8.7/ i386-linux /usr/lib/perl5/5.8.7 /usr/lib/perl5/site_perl/5.8.7/i386-linux /usr/l ib/perl5/site_perl/5.8.7 /usr/lib/perl5/site_perl/5.8.6 /usr/lib/perl5/site_perl /5.8.5 /usr/lib/perl5/site_perl/5.8.4 /usr/lib/perl5/site_perl/5.8.3 /usr/lib/pe rl5/site_perl /usr/lib/perl5/vendor_perl/5.8.7/i386-linux /usr/lib/perl5/vendor_ perl/5.8.7 /usr/lib/perl5/vendor_perl/5.8.6 /usr/lib/perl5/vendor_perl/5.8.6/i38 6-linux /usr/lib/perl5/vendor_perl/5.8.5 /usr/lib/perl5/vendor_perl/5.8.4 /usr/l ib/perl5/vendor_perl/5.8.3 /usr/lib/perl5/vendor_perl .) at Makefile.PL line 8.
BEGIN failed--compilation aborted at Makefile.PL line 8.
ERROR: Could not configure SpamAssassin
cd: error retrieving current directory: getcwd: cannot access parent directories : Datei oder Verzeichnis nicht gefunden
mv: Aufruf von stat für „binaries/aps.tar.gz“ nicht möglich: Datei oder Verzeich nis nicht gefunden
mv: Aufruf von stat für „binaries/spamassassin.tar.gz“ nicht möglich: Datei oder Verzeichnis nicht gefunden
mv: Aufruf von stat für „binaries/uudeview.tar.gz“ nicht möglich: Datei oder Ver zeichnis nicht gefunden
mv: Aufruf von stat für „binaries/clamav.tar.gz“ nicht möglich: Datei oder Verze ichnis nicht gefunden
mv: Aufruf von stat für „binaries/cronolog“ nicht möglich: Datei oder Verzeichni s nicht gefunden
mv: Aufruf von stat für „binaries/cronosplit“ nicht möglich: Datei oder Verzeich nis nicht gefunden
mv: Aufruf von stat für „binaries/ispconfig_tcpserver“ nicht möglich: Datei oder Verzeichnis nicht gefunden
mv: Aufruf von stat für „binaries/zip“ nicht möglich: Datei oder Verzeichnis nic ht gefunden
mv: Aufruf von stat für „binaries/unzip“ nicht möglich: Datei oder Verzeichnis n icht gefunden
tar: spamassassin.tar.gz: Kann open nicht ausführen.: Datei oder Verzeichnis nic ht gefunden
tar: Nicht behebbarer Fehler: Programmabbruch.
tar: Child returned status 2
tar: Fehler beim Beenden, verursacht durch vorhergehende Fehler.
mv: Aufruf von stat für „spamassassin“ nicht möglich: Datei oder Verzeichnis nic ht gefunden
tar: uudeview.tar.gz: Kann open nicht ausführen.: Datei oder Verzeichnis nicht g efunden
tar: Nicht behebbarer Fehler: Programmabbruch.
tar: Child returned status 2
tar: Fehler beim Beenden, verursacht durch vorhergehende Fehler.
mv: Aufruf von stat für „uudeview“ nicht möglich: Datei oder Verzeichnis nicht g efunden
tar: clamav.tar.gz: Kann open nicht ausführen.: Datei oder Verzeichnis nicht gef unden
tar: Nicht behebbarer Fehler: Programmabbruch.
tar: Child returned status 2
tar: Fehler beim Beenden, verursacht durch vorhergehende Fehler.
mv: Aufruf von stat für „clamav“ nicht möglich: Datei oder Verzeichnis nicht gef unden
tar: aps.tar.gz: Kann open nicht ausführen.: Datei oder Verzeichnis nicht gefund en
tar: Nicht behebbarer Fehler: Programmabbruch.
tar: Child returned status 2
tar: Fehler beim Beenden, verursacht durch vorhergehende Fehler.
./setup2: line 794: ispconfig_tmp/php/bin/php: Datei oder Verzeichnis nicht gefu nden
ERROR: Das mitgelieferte PHP-Binary funktioniert auf Ihrem System nicht! Die Ins tallation bricht hier ab!
[root@localhost install_ispconfig]#

till 25th April 2006 21:55

A perl module is missing. You can install the missing perl module with:

Quote:

perl -MCPAN -e "shell"
cpan>install ExtUtils::MakeMaker
Then unpack ISPConfig again and run the setup script.

Samatttv 26th April 2006 21:14

Hate to add to the issues here, but I'm stuck at a similar problem.

After doing a Perfect Install of Fedora 4, when I try to setup ISPConfig, I run into this:
Quote:

Configured for linux-elf.
making all in crypto...
make[1]: Entering directory `/root/install_ispconfig/compile_aps/openssl-0.9.8a/crypto'
( echo "#ifndef MK1MF_BUILD"; \
echo ' /* auto-generated by crypto/Makefile for crypto/cversion.c */'; \
echo ' #define CFLAGS "gcc -DOPENSSL_THREADS -D_REENTRANT -DDSO_DLFCN -DHAVE_DLFCN_H -DL_ENDIAN -DTERMIO -O3 -fomit-frame-pointer -Wall -DOPENSSL_BN_ASM_PART_WORDS -DOPENSSL_IA32_SSE2 -DSHA1_ASM -DMD5_ASM -DRMD160_ASM -DAES_ASM"'; \
echo ' #define PLATFORM "linux-elf"'; \
echo " #define DATE \"`LC_ALL=C LC_TIME=C date`\""; \
echo '#endif' ) >buildinf.h
gcc -I. -I.. -I../include -DOPENSSL_THREADS -D_REENTRANT -DDSO_DLFCN -DHAVE_DLFCN_H -DL_ENDIAN -DTERMIO -O3 -fomit-frame-pointer -Wall -DOPENSSL_BN_ASM_PART_WORDS -DOPENSSL_IA32_SSE2 -DSHA1_ASM -DMD5_ASM -DRMD160_ASM -DAES_ASM -c -o cryptlib.o cryptlib.c
make[1]: gcc: Command not found
make[1]: *** [cryptlib.o] Error 127
make[1]: Leaving directory `/root/install_ispconfig/compile_aps/openssl-0.9.8a/crypto'
make: *** [build_crypto] Error 1
ERROR: Could not make OpenSSL
cd: error retrieving current directory: getcwd: cannot access parent directories: No such file or directory
mv: cannot stat `binaries/aps.tar.gz': No such file or directory
mv: cannot stat `binaries/spamassassin.tar.gz': No such file or directory
mv: cannot stat `binaries/uudeview.tar.gz': No such file or directory
mv: cannot stat `binaries/clamav.tar.gz': No such file or directory
mv: cannot stat `binaries/cronolog': No such file or directory
mv: cannot stat `binaries/cronosplit': No such file or directory
mv: cannot stat `binaries/ispconfig_tcpserver': No such file or directory
mv: cannot stat `binaries/zip': No such file or directory
mv: cannot stat `binaries/unzip': No such file or directory
tar: spamassassin.tar.gz: Cannot open: No such file or directory
tar: Error is not recoverable: exiting now
tar: Child returned status 2
tar: Error exit delayed from previous errors
mv: cannot stat `spamassassin': No such file or directory
tar: uudeview.tar.gz: Cannot open: No such file or directory
tar: Error is not recoverable: exiting now
tar: Child returned status 2
tar: Error exit delayed from previous errors
mv: cannot stat `uudeview': No such file or directory
tar: clamav.tar.gz: Cannot open: No such file or directory
tar: Error is not recoverable: exiting now
tar: Child returned status 2
tar: Error exit delayed from previous errors
mv: cannot stat `clamav': No such file or directory
tar: aps.tar.gz: Cannot open: No such file or directory
tar: Error is not recoverable: exiting now
tar: Child returned status 2
tar: Error exit delayed from previous errors
./setup2: line 794: ispconfig_tmp/php/bin/php: No such file or directory
ERROR: The PHP binary coming with ISPConfig does not work properly on your system! The installation routine stops here!
Thanks for any help.

till 26th April 2006 22:03

Quote:

Originally Posted by Samatttv
Hate to add to the issues here, but I'm stuck at a similar problem.

After doing a Perfect Install of Fedora 4, when I try to setup ISPConfig, I run into this:

You dont have the GCC compiler installed on your server.

Install the packages:

gcc, flex and bison


All times are GMT +2. The time now is 12:17.

Powered by vBulletin® Version 3.8.7
Copyright ©2000 - 2014, vBulletin Solutions, Inc.