HowtoForge Forums | HowtoForge - Linux Howtos and Tutorials

HowtoForge Forums | HowtoForge - Linux Howtos and Tutorials (http://www.howtoforge.com/forums/index.php)
-   Installation/Configuration (http://www.howtoforge.com/forums/forumdisplay.php?f=16)
-   -   ERROR: Could not make ClamAV (http://www.howtoforge.com/forums/showthread.php?t=18966)

chua_jose 3rd January 2008 14:38

ERROR: Could not make ClamAV
 
Hello to all, I have installed rhel-x86_64-server-5 and when I do ./setup me the following mistake appears:
Code:

gcc -shared  .libs/matcher-ac.o .libs/matcher-bm.o .libs/matcher-ncore.o .libs/matcher.o .libs/md5.o .libs/others.o .libs/readdb.o .libs/cvd.o .libs/dsig.o .libs/str.o .libs/scanners.o .libs/filetypes.o .libs/rtf.o .libs/blob.o .libs/mbox.o .libs/message.o .libs/snprintf.o .libs/table.o .libs/text.o .libs/ole2_extract.o .libs/vba_extract.o .libs/msexpand.o .libs/pe.o .libs/upx.o .libs/htmlnorm.o .libs/chmunpack.o .libs/rebuildpe.o .libs/petite.o .libs/wwunpack.o .libs/suecrypt.o .libs/unsp.o .libs/aspack.o .libs/packlibs.o .libs/fsg.o .libs/mew.o .libs/upack.o .libs/line.o .libs/untar.o .libs/unzip.o .libs/special.o .libs/binhex.o .libs/is_tar.o .libs/tnef.o .libs/unrar15.o .libs/unrarvm.o .libs/unrar.o .libs/unrarfilter.o .libs/unrarppm.o .libs/unrar20.o .libs/unrarcmd.o .libs/LZMADecode.o .libs/bzlib.o .libs/infblock.o .libs/nulsft.o .libs/pdf.o .libs/spin.o .libs/yc.o .libs/elf.o .libs/sis.o .libs/uuencode.o .libs/phishcheck.o .libs/phish_domaincheck_db.o .libs/phish_whitelist.o .libs/regex_list.o .libs/sha256.o .libs/mspack.o .libs/cab.o .libs/entconv.o .libs/hashtab.o .libs/dconf.o .libs/lockdb.o  -L/usr/local/lib -lz -lpthread -lnsl  -Wl,-soname -Wl,libclamav.so.2 -o .libs/libclamav.so.2.0.8
/usr/bin/ld: /usr/local/lib/libz.a(gzio.o): relocation R_X86_64_32 against `a local symbol' can not be used when making a shared object; recompile with -fPIC
/usr/local/lib/libz.a: could not read symbols: Bad value
collect2: ld returned 1 exit status
make[2]: *** [libclamav.la] Error 1
make[2]: se sale del directorio `/usr/src/install_ispconfig/compile_aps/clamav-0.91.2/libclamav'
make[1]: *** [all-recursive] Error 1
make[1]: se sale del directorio `/usr/src/install_ispconfig/compile_aps/clamav-0.91.2'
make: *** [all] Error 2
ERROR: Could not make ClamAV
cd: error retrieving current directory: getcwd: cannot access parent directories: No existe el fichero o el directorio
mv: no se puede efectuar `stat' sobre «binaries/aps.tar.gz»: No existe el fichero o el directorio
mv: no se puede efectuar `stat' sobre «binaries/spamassassin.tar.gz»: No existe el fichero o el directorio
mv: no se puede efectuar `stat' sobre «binaries/uudeview.tar.gz»: No existe el fichero o el directorio
mv: no se puede efectuar `stat' sobre «binaries/clamav.tar.gz»: No existe el fichero o el directorio
mv: no se puede efectuar `stat' sobre «binaries/cronolog»: No existe el fichero o el directorio
mv: no se puede efectuar `stat' sobre «binaries/cronosplit»: No existe el fichero o el directorio
mv: no se puede efectuar `stat' sobre «binaries/ispconfig_tcpserver»: No existe el fichero o el directorio
mv: no se puede efectuar `stat' sobre «binaries/zip»: No existe el fichero o el directorio
mv: no se puede efectuar `stat' sobre «binaries/unzip»: No existe el fichero o el directorio
tar: spamassassin.tar.gz: No se puede open: No existe el fichero o el directorio
tar: El error no es recuperable: salida ahora
tar: Child returned status 2
tar: Salida con error demorada desde errores anteriores
mv: no se puede efectuar `stat' sobre «spamassassin»: No existe el fichero o el directorio
tar: uudeview.tar.gz: No se puede open: No existe el fichero o el directorio
tar: El error no es recuperable: salida ahora
tar: Child returned status 2
tar: Salida con error demorada desde errores anteriores
mv: no se puede efectuar `stat' sobre «uudeview»: No existe el fichero o el directorio
tar: clamav.tar.gz: No se puede open: No existe el fichero o el directorio
tar: El error no es recuperable: salida ahora
tar: Child returned status 2
tar: Salida con error demorada desde errores anteriores
mv: no se puede efectuar `stat' sobre «clamav»: No existe el fichero o el directorio
tar: aps.tar.gz: No se puede open: No existe el fichero o el directorio
tar: El error no es recuperable: salida ahora
tar: Child returned status 2
tar: Salida con error demorada desde errores anteriores
./setup2: line 873: ispconfig_tmp/php/bin/php: No existe el fichero o el directorio
ERROR: The PHP binary coming with ISPConfig does not work properly on your system! The installation routine stops here!
gcc -shared  .libs/matcher-ac.o .libs/matcher-bm.o .libs/matcher-ncore.o .libs/matcher.o .libs/md5.o .libs/others.o .libs/readdb.o .libs/cvd.o .libs/dsig.o .libs/str.o .libs/scanners.o .libs/filetypes.o .libs/rtf.o .libs/blob.o .libs/mbox.o .libs/message.o .libs/snprintf.o .libs/table.o .libs/text.o .libs/ole2_extract.o .libs/vba_extract.o .libs/msexpand.o .libs/pe.o .libs/upx.o .libs/htmlnorm.o .libs/chmunpack.o .libs/rebuildpe.o .libs/petite.o .libs/wwunpack.o .libs/suecrypt.o .libs/unsp.o .libs/aspack.o .libs/packlibs.o .libs/fsg.o .libs/mew.o .libs/upack.o .libs/line.o .libs/untar.o .libs/unzip.o .libs/special.o .libs/binhex.o .libs/is_tar.o .libs/tnef.o .libs/unrar15.o .libs/unrarvm.o .libs/unrar.o .libs/unrarfilter.o .libs/unrarppm.o .libs/unrar20.o .libs/unrarcmd.o .libs/LZMADecode.o .libs/bzlib.o .libs/infblock.o .libs/nulsft.o .libs/pdf.o .libs/spin.o .libs/yc.o .libs/elf.o .libs/sis.o .libs/uuencode.o .libs/phishcheck.o .libs/phish_domaincheck_db.o .libs/phish_whitelist.o .libs/regex_list.o .libs/sha256.o .libs/mspack.o .libs/cab.o .libs/entconv.o .libs/hashtab.o .libs/dconf.o .libs/lockdb.o  -L/usr/local/lib -lz -lpthread -lnsl  -Wl,-soname -Wl,libclamav.so.2 -o .libs/libclamav.so.2.0.8
/usr/bin/ld: /usr/local/lib/libz.a(gzio.o): relocation R_X86_64_32 against `a local symbol' can not be used when making a shared object; recompile with -fPIC
/usr/local/lib/libz.a: could not read symbols: Bad value
collect2: ld returned 1 exit status
make[2]: *** [libclamav.la] Error 1
make[2]: se sale del directorio `/usr/src/install_ispconfig/compile_aps/clamav-0.91.2/libclamav'
make[1]: *** [all-recursive] Error 1
make[1]: se sale del directorio `/usr/src/install_ispconfig/compile_aps/clamav-0.91.2'
make: *** [all] Error 2
:confused: :confused:
cd: error retrieving current directory: getcwd: cannot access parent directories: No existe el fichero o el directorio
mv: no se puede efectuar `stat' sobre «binaries/aps.tar.gz»: No existe el fichero o el directorio
mv: no se puede efectuar `stat' sobre «binaries/spamassassin.tar.gz»: No existe el fichero o el directorio
mv: no se puede efectuar `stat' sobre «binaries/uudeview.tar.gz»: No existe el fichero o el directorio
mv: no se puede efectuar `stat' sobre «binaries/clamav.tar.gz»: No existe el fichero o el directorio
mv: no se puede efectuar `stat' sobre «binaries/cronolog»: No existe el fichero o el directorio
mv: no se puede efectuar `stat' sobre «binaries/cronosplit»: No existe el fichero o el directorio
mv: no se puede efectuar `stat' sobre «binaries/ispconfig_tcpserver»: No existe el fichero o el directorio
mv: no se puede efectuar `stat' sobre «binaries/zip»: No existe el fichero o el directorio
mv: no se puede efectuar `stat' sobre «binaries/unzip»: No existe el fichero o el directorio
tar: spamassassin.tar.gz: No se puede open: No existe el fichero o el directorio
tar: El error no es recuperable: salida ahora
tar: Child returned status 2
tar: Salida con error demorada desde errores anteriores
mv: no se puede efectuar `stat' sobre «spamassassin»: No existe el fichero o el directorio
tar: uudeview.tar.gz: No se puede open: No existe el fichero o el directorio
tar: El error no es recuperable: salida ahora
tar: Child returned status 2
tar: Salida con error demorada desde errores anteriores
mv: no se puede efectuar `stat' sobre «uudeview»: No existe el fichero o el directorio
tar: clamav.tar.gz: No se puede open: No existe el fichero o el directorio
tar: El error no es recuperable: salida ahora
tar: Child returned status 2
tar: Salida con error demorada desde errores anteriores
mv: no se puede efectuar `stat' sobre «clamav»: No existe el fichero o el directorio
tar: aps.tar.gz: No se puede open: No existe el fichero o el directorio
tar: El error no es recuperable: salida ahora
tar: Child returned status 2
tar: Salida con error demorada desde errores anteriores
./setup2: line 873: ispconfig_tmp/php/bin/php: No existe el fichero o el directorio
ERROR: The PHP binary coming with ISPConfig does not work properly on your system! The installation routine stops here!

I have installed zlib and zlib-devel.
I used guia perfert setup Centos 5.

chua_jose 3rd January 2008 17:47

all ok
thanks

ln -s /usr/lib /usr/lib64

;)


All times are GMT +2. The time now is 20:09.

Powered by vBulletin® Version 3.8.7
Copyright ©2000 - 2014, vBulletin Solutions, Inc.